{"text_format":"1","workbook":"xlsx","n_sheets":10,"sheets":["Eingaben","Herbstfrühjahr","Winter","Sommer","Diagramme","Maxpeak","Jahreshochrechnung","Amortisation","Temperaturen","Info"],"not_rendered":{"charts":11,"images":2,"macros":1,"external_links":0,"defined_names":0,"comments":7,"pivot_tables":0},"unopened":[],"bounds":{"document_bytes":16777216,"sheet_cells":100000,"rows_first":2000,"rows_last":500,"rows_between":2000,"halvings":0,"cell_chars":16384,"cell_head_chars":4096},"cells_cut":0,"cells_raw":0,"read":"whole","date_system":"1900"}

{"sheet":"Eingaben","index":0,"n_rows":154,"n_cols":18,"rows_kept":154,"cut":false,"hidden":false,"merged":[[122,13,122,15],[121,13,121,17],[121,10,121,11],[66,0,68,1],[70,0,72,1],[74,0,76,1],[78,0,80,1],[82,0,84,1],[103,2,103,7],[90,0,95,1],[8,13,8,17],[119,10,120,10],[41,10,42,10],[43,13,43,17],[79,13,79,17],[29,10,29,11],[44,13,44,15],[80,13,80,15],[143,10,143,11],[7,0,7,1],[18,0,18,1],[29,0,29,1],[79,10,79,11],[108,10,108,11],[43,10,43,11],[7,10,7,11],[18,10,18,11],[97,0,102,1],[104,0,110,1],[132,10,132,11],[96,0,96,8],[1,0,1,1],[0,2,0,8],[5,10,6,11],[86,0,88,1],[42,0,44,1],[46,0,48,1],[50,0,52,1],[54,0,56,1],[58,0,60,1],[62,0,64,1],[41,0,41,8]]}
["Version",18,"Solartirol Tool zur Berechnung der KW Leistung /Ertrag / Wirkungsgrad/Puffererwärmung mit verschiedenen Kollektoren im Tagesverlauf (mit Winkelfaktor)"]
["allgemeine Eingaben",null,"Infos > ",null,null,null,null,null,null,null,"Korrekturfaktor Winter > ",95,{"$f":"P18","v":22.229069000000003},"kWh (Einstrahlung)",{"$f":" \"in \"&L18&\" Std. \"","v":"in 7,5 Std. "}]
["Diff.Winter > ",28,"Kollektor > ","SolRose 26","Synergie 210","Sunex AMX 2,85","Sunex 2,0","Star Azzurro CPC","Billig VRK",null,"Korrekturfaktor Herbst Frühjahr > ",100,{"$f":"P29","v":63.849234666666675},"kWh (Einstrahlung)",{"$f":" \"in \"&L29&\" Std. \"","v":"in 8,5 Std. "}]
["Diff.Frühjahr/Herbst > ",32,"Bruttofl.(m²) > ",2.6,2.0699999999999998,2.87,2.0299999999999998,3.92,4.18,null,"Korrekturfaktor Sommer > ",100,{"$f":"P40","v":54.822603333333333},"kWh (Einstrahlung)",{"$f":" \"in \"&L40&\" Std. \"","v":"in 5,9 Std. "}]
["Diff.Sommer > ",35,"Aperturfl. (m²) > ",2.4700000000000002,1.92,2.67,1.84,3.47,2.84]
[" Gesamtfläche (m²) > ",10.46,"η0 > ",0.81,0.78500000000000003,0.82,0.8,0.64,0.65400000000000003,null,"Strahlung bei Sonne mit Korrekturfaktor"]
["Puffervolumen (L) > ",1500,"a1 > ",3.36,3.722,3.29,4.16,0.749,1.82]
["Eingaben Winter",null,"a2 > ",1.41E-2,1.2E-2,2.3E-2,4.0000000000000001E-3,5.0000000000000001E-3,6.6E-3,null,"Eingaben Winter"]
["GBS zu Datum (W/m²)","2013-12-21","IAM 0° > ",1,1,1,1,1,1,null,"GBS zu Datum (W/m²)",{"$f":"B9","v":"2013-12-21"},null,"kWh der Tageseinstrahlung bei Sonne"]
["Strahlung   0°",632,"IAM 10° > ",1,1,1,1,1.01,1,null,"Strahlung   0°",{"$f":"IF($L$2>0,B10/100*$L$2,B10)","v":600.4},null,{"$f":"L10","v":600.4},{"$f":"IF(N10>0,N10/1000,0)","v":0.60039999999999993},{"$f":"O10*($L$18/15)","v":0.30019999999999997}]
["Strahlung 10°",616,"IAM 20° > ",1,0.99,0.99,0.99,1.01,1.04,null,"Strahlung 10°",585.20000000000005,null,585.20000000000005,0.58520000000000005,{"$f":"O11*($L$18/15)*2","v":0.58520000000000005}]
["Strahlung 20°",532,"IAM 30° > ",0.99,0.98,0.98,0.98,1.02,1.1499999999999999,null,"Strahlung 20°",505.40000000000003,null,505.40000000000003,0.50540000000000007,0.50540000000000007]
["Strahlung 30°",423,"IAM 40° > ",0.96,0.97,0.97,0.97,1.02,1.3,null,"Strahlung 30°",401.85,null,401.85,0.40185000000000004,0.40185000000000004]
["Strahlung 40°",254,"IAM 50° > ",0.94,0.94,0.94,0.95,0.98,1.36,null,"Strahlung 40°",241.3,null,241.3,0.24130000000000001,0.24130000000000001]
["Strahlung 50°",96,"IAM 60° > ",0.86,0.9,0.9,0.9,1.05,1.34,null,"Strahlung 50°",91.2,null,91.2,9.1200000000000003E-2,9.1200000000000003E-2]
["Strahlung 60°",0,"IAM 70° > ",0.73,0.8,0.81,0.81,1.1399999999999999,1.1100000000000001,null,"Strahlung 60°",0,null,0,0,0]
["Strahlung 70°",0,"Kollektorpreis (Euro/m²) > ",null,104,null,135,650,218,null,"Strahlung 70°",0,null,0,0,0]
["Laufzeit gesamt (Std.) > ",7.5,{"$f":"C3","v":"Kollektor > "},"SolRose 26","Synergie 210","Sunex AMX 2,85","Sunex 2,0","Star Azzurro CPC","Billig VRK",null,"Laufzeit gesamt (Std.) > ",{"$f":"B18","v":7.5},null,null,null,{"$f":"SUM(P10:P17)*$B$6","v":22.229069000000003},{"$f":"P18/$B$6","v":2.1251500000000001},"kWh/m²"]
["Eingaben Frühjahr/Herbst",null,"Bruttoflächenanteil (%) >",{"$f":"Maxpeak!D9","v":95},{"$f":"Maxpeak!E9","v":92.753623188405797},{"$f":"Maxpeak!F9","v":93.031358885017426},{"$f":"Maxpeak!G9","v":90.640394088669964},{"$f":"Maxpeak!H9","v":88.520408163265316},{"$f":"Maxpeak!I9","v":67.942583732057415},null,"Eingaben Frühjahr/Herbst"]
["GBS zu Datum (W/m²)","2013-09-23","η0 nach Apertur >",{"$f":"Maxpeak!D10","v":81},{"$f":"Maxpeak!E10","v":78.5},{"$f":"Maxpeak!F10","v":82},{"$f":"Maxpeak!G10","v":80},{"$f":"Maxpeak!H10","v":64},{"$f":"Maxpeak!I10","v":65.400000000000006},null,"GBS zu Datum (W/m²)",{"$f":"B20","v":"2013-09-23"}]
["Strahlung   0°",942,"max.Peak.n. Gesamtfl.(W) >",{"$f":"IF(D4>0,Maxpeak!D12/D4*$B$6,\"\")","v":8048.9699999999984},{"$f":"IF(E4>0,Maxpeak!E12/E4*$B$6,\"\")","v":7616.0927536231893},{"$f":"IF(F4>0,Maxpeak!F12/F4*$B$6,\"\")","v":7979.4857142857154},{"$f":"IF(G4>0,Maxpeak!G12/G4*$B$6,\"\")","v":7584.7881773399031},{"$f":"IF(H4>0,Maxpeak!H12/H4*$B$6,\"\")","v":5925.9102040816351},{"$f":"IF(I4>0,Maxpeak!I12/I4*$B$6,\"\")","v":4647.843444976078},null,"Strahlung   0°",{"$f":"IF($L$3>0,B21/100*$L$3,B21)","v":942},null,{"$f":"L21","v":942},{"$f":"IF(N21>0,N21/1000,0)","v":0.94199999999999995},{"$f":"O21*($L$29/15)","v":0.53379999999999994}]
["Strahlung 10°",931,null,null,null,null,null,null,null,null,"Strahlung 10°",931,null,931,0.93100000000000005,{"$f":"O22*($L$29/15)*2","v":1.0551333333333333}]
["Strahlung 20°",897,null,null,null,null,null,null,null,null,"Strahlung 20°",897.00000000000011,null,897.00000000000011,0.89700000000000013,1.0166000000000002]
["Strahlung 30°",834,null,null,null,null,null,null,null,null,"Strahlung 30°",834,null,834,0.83399999999999996,0.94519999999999993]
["Strahlung 40°",744,null,null,null,null,null,null,null,null,"Strahlung 40°",744,null,744,0.74399999999999999,0.84319999999999995]
["Strahlung 50°",657,null,null,null,null,null,null,null,null,"Strahlung 50°",657,null,657,0.65700000000000003,0.74460000000000004]
["Strahlung 60°",524,null,null,null,null,null,null,null,null,"Strahlung 60°",524,null,524,0.52400000000000002,0.59386666666666665]
["Strahlung 70°",328,null,null,null,null,null,null,null,null,"Strahlung 70°",328,null,328,0.32800000000000001,0.37173333333333336]
["Laufzeit gesamt (Std.) > ",8.5,null,null,null,null,null,null,null,null,"Laufzeit gesamt (Std.) > ",{"$f":"B29","v":8.5},null,null,null,{"$f":"SUM(P21:P28)*$B$6","v":63.849234666666675},{"$f":"P29/$B$6","v":6.1041333333333334},"kWh/m²"]
["Eingaben Sommer",null,null,null,null,null,null,null,null,null,"Eingaben Sommer"]
["GBS zu Datum (W/m²)","2013-06-21",null,null,null,null,null,null,null,null,"GBS zu Datum (W/m²)",{"$f":"B31","v":"2013-06-21"}]
["Strahlung   0°",993,null,null,null,null,null,null,null,null,"Strahlung   0°",{"$f":"IF($L$4>0,B32/100*$L$4,B32)","v":993},null,{"$f":"L32","v":993},{"$f":"IF(N32>0,N32/1000,0)","v":0.99299999999999999},{"$f":"O32*($L$40/15)","v":0.39058000000000004}]
["Strahlung 10°",990,null,null,null,null,null,null,null,null,"Strahlung 10°",990,null,990,0.99,{"$f":"O33*($L$40/15)*2","v":0.77880000000000005}]
["Strahlung 20°",977,null,null,null,null,null,null,null,null,"Strahlung 20°",977,null,977,0.97699999999999998,0.76857333333333333]
["Strahlung 30°",955,null,null,null,null,null,null,null,null,"Strahlung 30°",955.00000000000011,null,955.00000000000011,0.95500000000000007,0.75126666666666675]
["Strahlung 40°",920,null,null,null,null,null,null,null,null,"Strahlung 40°",919.99999999999989,null,919.99999999999989,0.91999999999999993,0.72373333333333334]
["Strahlung 50°",865,null,null,null,null,null,null,null,null,"Strahlung 50°",865,null,865,0.86499999999999999,0.68046666666666678]
["Strahlung 60°",786,null,null,null,null,null,null,null,null,"Strahlung 60°",786,null,786,0.78600000000000003,0.61832000000000009]
["Strahlung 70°",673,null,null,null,null,null,null,null,null,"Strahlung 70°",673,null,673,0.67300000000000004,0.52942666666666671]
["Laufzeit gesamt (Std.) > ",5.9,null,null,null,null,null,null,null,null,"Laufzeit gesamt (Std.) > ",{"$f":"B40","v":5.9},null,null,null,{"$f":"SUM(P32:P39)*$B$6","v":54.822603333333333},{"$f":"P40/$B$6","v":5.2411666666666665},"kWh/m²"]
[]
["Übersicht ! (maximaler Jahreszeitenertrag und hoch gerechneter Jahresertrag bei verschiedenen Bedingungen je nach Einstellungen der Kollektorfläche und Differenz)",null,null,null,null,null,null,null,null,null,"Strahlung bei leichter Bewölkung","Faktor (%)"]
["Sommer bei Sonne",null,"KW Schnitt >",{"$f":"Sommer!D43","v":5.4843163544200006},{"$f":"Sommer!E43","v":5.1113425038222244},{"$f":"Sommer!F43","v":5.4350118969101038},{"$f":"Sommer!G43","v":5.0773810907848951},{"$f":"Sommer!H43","v":5.092556118730613},{"$f":"Sommer!I43","v":4.2187456309537472},null,null,75]
[null,null,"Tagesertrag kWh >",{"$f":"Sommer!D44","v":32.357466491078007},{"$f":"Sommer!E44","v":30.156920772551125},{"$f":"Sommer!F44","v":32.066570191769614},{"$f":"Sommer!G44","v":29.956548435630882},{"$f":"Sommer!H44","v":30.046081100510619},{"$f":"Sommer!I44","v":24.89059922262711},null,"Eingaben Winter",null,null,"kWh der Tageseinstrahlung bei leichter Bewölkung"]
[null,null,"Puffererwärmung >",{"$f":"Sommer!D45","v":18.548275431973636},{"$f":"Sommer!E45","v":17.286856275466395},{"$f":"Sommer!F45","v":18.381524902132195},{"$f":"Sommer!G45","v":17.171996810335845},{"$f":"Sommer!H45","v":17.223319633425405},{"$f":"Sommer!I45","v":14.268041973417661},null,"GBS zu Datum (W/m²)",{"$f":"L9","v":"2013-12-21"},null,"kWh der Tageseinstrahlung"]
[null,null,null,null,null,null,null,null,null,null,"Strahlung   0°",{"$f":"L10/100*$L$43","v":450.29999999999995},null,{"$f":"L46","v":450.29999999999995},{"$f":"IF(N46>0,N46/1000,0)","v":0.45029999999999998},{"$f":"O46*($L$18/15)","v":0.22514999999999999}]
["Sommer leicht bewölkt",null,"KW Schnitt >",{"$f":"Sommer!D72","v":3.8014108769199999},{"$f":"Sommer!E72","v":3.5015721363478272},{"$f":"Sommer!F72","v":3.7466431539386762},{"$f":"Sommer!G72","v":3.4703389261346471},{"$f":"Sommer!H72","v":3.7422604418979599},{"$f":"Sommer!I72","v":3.0144119303030306},null,"Strahlung 10°",438.90000000000003,null,438.90000000000003,0.43890000000000001,{"$f":"O47*($L$18/15)*2","v":0.43890000000000001}]
[null,null,"Tagesertrag kWh >",{"$f":"Sommer!D73","v":22.428324173827999},{"$f":"Sommer!E73","v":20.65927560445218},{"$f":"Sommer!F73","v":22.10519460823819},{"$f":"Sommer!G73","v":20.474999664194421},{"$f":"Sommer!H73","v":22.079336607197966},{"$f":"Sommer!I73","v":17.785030388787881},null,"Strahlung 20°",379.05,null,379.05,0.37905,0.37905]
[null,null,"Puffererwärmung >",{"$f":"Sommer!D74","v":12.856591673160217},{"$f":"Sommer!E74","v":11.842519693007842},{"$f":"Sommer!F74","v":12.671364063191854},{"$f":"Sommer!G74","v":11.736887167781267},{"$f":"Sommer!H74","v":12.656541477327583},{"$f":"Sommer!I74","v":10.19491567141753},null,"Strahlung 30°",301.38750000000005,null,301.38750000000005,0.30138750000000003,0.30138750000000003]
[null,null,null,null,null,null,null,null,null,null,"Strahlung 40°",180.97500000000002,null,180.97500000000002,0.18097500000000002,0.18097500000000002]
["Sommer mittel bewölkt",null,"KW Schnitt >",{"$f":"Sommer!D101","v":2.1185053994200005},{"$f":"Sommer!E101","v":1.8918017688734305},{"$f":"Sommer!F101","v":2.0582744109672473},{"$f":"Sommer!G101","v":1.8632967614844014},{"$f":"Sommer!H101","v":2.391964765065306},{"$f":"Sommer!I101","v":1.810078229652313},null,"Strahlung 50°",68.400000000000006,null,68.400000000000006,6.8400000000000002E-2,6.8400000000000002E-2]
[null,null,"Tagesertrag kWh >",{"$f":"Sommer!D102","v":12.499181856578003},{"$f":"Sommer!E102","v":11.16163043635324},{"$f":"Sommer!F102","v":12.14381902470676},{"$f":"Sommer!G102","v":10.993450892757968},{"$f":"Sommer!H102","v":14.112592113885306},{"$f":"Sommer!I102","v":10.679461554948647},null,"Strahlung 60°",0,null,0,0,0]
[null,null,"Puffererwärmung >",{"$f":"Sommer!D103","v":7.1649079143468066},{"$f":"Sommer!E103","v":6.3981831105492928},{"$f":"Sommer!F103","v":6.9612032242515109},{"$f":"Sommer!G103","v":6.3017775252266945},{"$f":"Sommer!H103","v":8.0897633212297535},{"$f":"Sommer!I103","v":6.1217893694173959},null,"Strahlung 70°",0,null,0,0,0]
[null,null,null,null,null,null,null,null,null,null,"Laufzeit gesamt (Std.) > ",{"$f":"L18","v":7.5},null,null,null,{"$f":"SUM(P46:P53)*$B$6","v":16.671801750000004},{"$f":"P54/$B$6","v":1.5938625000000002},"kWh/m²"]
["Sommer stark bewölkt",null,"KW Schnitt >",{"$f":"Sommer!D130","v":0.43423616804000009},{"$f":"Sommer!E130","v":0.29537492526376818},{"$f":"Sommer!F130","v":0.37553879566689891},{"$f":"Sommer!G130","v":0.2725353446568145},{"$f":"Sommer!H130","v":0.96398040545714314},{"$f":"Sommer!I130","v":0.56551244080216911},null,"Eingaben Frühjahr/Herbst"]
[null,null,"Tagesertrag kWh >",{"$f":"Sommer!D131","v":2.5619933914360007},{"$f":"Sommer!E131","v":1.7427120590562324},{"$f":"Sommer!F131","v":2.2156788944347037},{"$f":"Sommer!G131","v":1.6079585334752056},{"$f":"Sommer!H131","v":5.6874843921971445},{"$f":"Sommer!I131","v":3.3365234007327982},null,"GBS zu Datum (W/m²)",{"$f":"L20","v":"2013-09-23"}]
[null,null,"Puffererwärmung >",{"$f":"Sommer!D132","v":1.4686118609550018},{"$f":"Sommer!E132","v":0.99897509834120524},{"$f":"Sommer!F132","v":1.2700939492317018},{"$f":"Sommer!G132","v":0.9217303144025254},{"$f":"Sommer!H132","v":3.2602375421021179},{"$f":"Sommer!I132","v":1.9125958158399532},null,"Strahlung   0°",{"$f":"L21/100*$L$43","v":706.5},null,{"$f":"L57","v":706.5},{"$f":"IF(N57>0,N57/1000,0)","v":0.70650000000000002},{"$f":"O57*($L$29/15)","v":0.40034999999999998}]
[null,null,null,null,null,null,null,null,null,null,"Strahlung 10°",698.25,null,698.25,0.69825000000000004,{"$f":"O58*($L$29/15)*2","v":0.79135}]
["Frühjahr Herbst bei Sonne",null,"KW Schnitt >",{"$f":"Herbstfrühjahr!D43","v":4.395392094668801},{"$f":"Herbstfrühjahr!E43","v":4.0574189084939141},{"$f":"Herbstfrühjahr!F43","v":4.3301631836443208},{"$f":"Herbstfrühjahr!G43","v":4.0175793705195426},{"$f":"Herbstfrühjahr!H43","v":4.0639825019276197},{"$f":"Herbstfrühjahr!I43","v":3.3131958597950888},null,"Strahlung 20°",672.75,null,672.75,0.67274999999999996,0.76244999999999996]
[null,null,"Tagesertrag kWh >",{"$f":"Herbstfrühjahr!D44","v":37.360832804684811},{"$f":"Herbstfrühjahr!E44","v":34.48806072219827},{"$f":"Herbstfrühjahr!F44","v":36.806387060976725},{"$f":"Herbstfrühjahr!G44","v":34.149424649416112},{"$f":"Herbstfrühjahr!H44","v":34.54385126638477},{"$f":"Herbstfrühjahr!I44","v":28.162164808258254},null,"Strahlung 30°",625.5,null,625.5,0.62549999999999994,0.70889999999999986]
[null,null,"Puffererwärmung >",{"$f":"Herbstfrühjahr!D45","v":21.41635586396378},{"$f":"Herbstfrühjahr!E45","v":19.769596286728731},{"$f":"Herbstfrühjahr!F45","v":21.098530846074365},{"$f":"Herbstfrühjahr!G45","v":19.575479879286966},{"$f":"Herbstfrühjahr!H45","v":19.801577108847678},{"$f":"Herbstfrühjahr!I45","v":16.143402011039413},null,"Strahlung 40°",558,null,558,0.55800000000000005,0.63240000000000007]
[null,null,null,null,null,null,null,null,null,null,"Strahlung 50°",492.75,null,492.75,0.49275000000000002,0.55845]
["Frühjahr Herbst leicht bewölkt",null,"KW Schnitt >",{"$f":"Herbstfrühjahr!D72","v":3.0145751932287999},{"$f":"Herbstfrühjahr!E72","v":2.7422186991489856},{"$f":"Herbstfrühjahr!F72","v":2.9513373103300342},{"$f":"Herbstfrühjahr!G72","v":2.7052947157543517},{"$f":"Herbstfrühjahr!H72","v":2.9785888383412251},{"$f":"Herbstfrühjahr!I72","v":2.3493973531087722},null,"Strahlung 60°",393,null,393,0.39300000000000002,0.44540000000000002]
[null,null,"Tagesertrag kWh >",{"$f":"Herbstfrühjahr!D73","v":25.623889142444799},{"$f":"Herbstfrühjahr!E73","v":23.308858942766378},{"$f":"Herbstfrühjahr!F73","v":25.08636713780529},{"$f":"Herbstfrühjahr!G73","v":22.995005083911987},{"$f":"Herbstfrühjahr!H73","v":25.318005125900413},{"$f":"Herbstfrühjahr!I73","v":19.969877501424563},null,"Strahlung 70°",245.99999999999997,null,245.99999999999997,0.24599999999999997,0.27879999999999994]
[null,null,"Puffererwärmung >",{"$f":"Herbstfrühjahr!D74","v":14.688385865545888},{"$f":"Herbstfrühjahr!E74","v":13.36134075251727},{"$f":"Herbstfrühjahr!F74","v":14.380262045173568},{"$f":"Herbstfrühjahr!G74","v":13.181430257329888},{"$f":"Herbstfrühjahr!H74","v":14.513043924276534},{"$f":"Herbstfrühjahr!I74","v":11.44733591368562},null,"Laufzeit gesamt (Std.) > ",{"$f":"L29","v":8.5},null,null,null,{"$f":"SUM(P57:P64)*$B$6","v":47.886925999999995},{"$f":"P65/$B$6","v":4.5780999999999992},"kWh/m²"]
[null,null,null,null,null,null,null,null,null,null,"Eingaben Sommer"]
["Frühjahr Herbst mittel bewölkt",null,"KW Schnitt >",{"$f":"Herbstfrühjahr!D101","v":1.6337582917888007},{"$f":"Herbstfrühjahr!E101","v":1.4297629997634786},{"$f":"Herbstfrühjahr!F101","v":1.5725114370157491},{"$f":"Herbstfrühjahr!G101","v":1.3991701225552715},{"$f":"Herbstfrühjahr!H101","v":1.8931951747548306},{"$f":"Herbstfrühjahr!I101","v":1.3855988464224562},null,"GBS zu Datum (W/m²)",{"$f":"L31","v":"2013-06-21"}]
[null,null,"Tagesertrag kWh >",{"$f":"Herbstfrühjahr!D102","v":13.886945480204806},{"$f":"Herbstfrühjahr!E102","v":12.152985497989569},{"$f":"Herbstfrühjahr!F102","v":13.366347214633867},{"$f":"Herbstfrühjahr!G102","v":11.892946041719808},{"$f":"Herbstfrühjahr!H102","v":16.092158985416059},{"$f":"Herbstfrühjahr!I102","v":11.777590194590879},null,"Strahlung   0°",{"$f":"L32/100*$L$43","v":744.75},null,{"$f":"L68","v":744.75},{"$f":"IF(N68>0,N68/1000,0)","v":0.74475000000000002},{"$f":"O68*($L$40/15)","v":0.29293500000000006}]
[null,null,"Puffererwärmung >",{"$f":"Herbstfrühjahr!D103","v":7.9604158671280061},{"$f":"Herbstfrühjahr!E103","v":6.9664577231238578},{"$f":"Herbstfrühjahr!F103","v":7.6619932442727814},{"$f":"Herbstfrühjahr!G103","v":6.8173952661047919},{"$f":"Herbstfrühjahr!H103","v":9.2245107397053943},{"$f":"Herbstfrühjahr!I103","v":6.7512698163318312},null,"Strahlung 10°",742.5,null,742.5,0.74250000000000005,{"$f":"O69*($L$40/15)*2","v":0.58410000000000006}]
[null,null,null,null,null,null,null,null,null,null,"Strahlung 20°",732.75,null,732.75,0.73275000000000001,0.57643000000000011]
["Frühjahr Herbst stark bewolkt",null,"KW Schnitt >",{"$f":"Herbstfrühjahr!D130","v":0.32471654803840017},{"$f":"Herbstfrühjahr!E130","v":0.21741167767497596},{"$f":"Herbstfrühjahr!F130","v":0.28341951255275266},{"$f":"Herbstfrühjahr!G130","v":0.19792120452834169},{"$f":"Herbstfrühjahr!H130","v":0.80780151116843546},{"$f":"Herbstfrühjahr!I130","v":0.43375978956458072},null,"Strahlung 30°","1901-12-16T06:00:00",null,716.25,0.71625000000000005,0.56345000000000012]
[null,null,"Tagesertrag kWh >",{"$f":"Herbstfrühjahr!D131","v":2.7600906583264013},{"$f":"Herbstfrühjahr!E131","v":1.8479992602372957},{"$f":"Herbstfrühjahr!F131","v":2.4090658566983976},{"$f":"Herbstfrühjahr!G131","v":1.6823302384909045},{"$f":"Herbstfrühjahr!H131","v":6.8663128449317012},{"$f":"Herbstfrühjahr!I131","v":3.6869582112989363},null,"Strahlung 40°",690,null,690,0.69,0.54280000000000006]
[null,null,"Puffererwärmung >",{"$f":"Herbstfrühjahr!D132","v":1.5821671873467478},{"$f":"Herbstfrühjahr!E132","v":1.0593288966679826},{"$f":"Herbstfrühjahr!F132","v":1.3809491869867569},{"$f":"Herbstfrühjahr!G132","v":0.96436241816618207},{"$f":"Herbstfrühjahr!H132","v":3.9359775551342513},{"$f":"Herbstfrühjahr!I132","v":2.1134756155339276},null,"Strahlung 50°",648.75,null,648.75,0.64875000000000005,0.51035000000000008]
[null,null,null,null,null,null,null,null,null,null,"Strahlung 60°",589.5,null,589.5,0.58950000000000002,0.46374000000000004]
["Winter bei Sonne",null,"KW Schnitt >",{"$f":"Winter!D43","v":1.5482883621540005},{"$f":"Winter!E43","v":1.3921779539354593},{"$f":"Winter!F43","v":1.5077900230087804},{"$f":"Winter!G43","v":1.3650102592147133},{"$f":"Winter!H43","v":1.5262170866443541},{"$f":"Winter!I43","v":1.0943066407502651},null,"Strahlung 70°","1901-05-18T18:00:00",null,504.75000000000006,0.50475000000000003,0.39707000000000003]
[null,null,"Tagesertrag kWh >",{"$f":"Winter!D44","v":11.612162716155003},{"$f":"Winter!E44","v":10.441334654515945},{"$f":"Winter!F44","v":11.308425172565853},{"$f":"Winter!G44","v":10.23757694411035},{"$f":"Winter!H44","v":11.446628149832655},{"$f":"Winter!I44","v":8.2072998056269881},null,"Laufzeit gesamt (Std.) > ",{"$f":"L40","v":5.9},null,null,null,{"$f":"SUM(P68:P75)*$B$6","v":41.116952500000004},{"$f":"P76/$B$6","v":3.9308749999999999},"kWh/m²"]
[null,null,"Puffererwärmung >",{"$f":"Winter!D45","v":6.6564417977386094},{"$f":"Winter!E45","v":5.9852878501094553},{"$f":"Winter!F45","v":6.4823302794874484},{"$f":"Winter!G45","v":5.8684877868216399},{"$f":"Winter!H45","v":6.5615523931399578},{"$f":"Winter!I45","v":4.7046717143175627}]
[null,null,null,null,null,null,null,null,null,null,"Strahlung bei mittlerer Bewölkung","Faktor (%)"]
["Winter leicht bewölkt",null,"KW Schnitt >",{"$f":"Winter!D72","v":1.0062493925835003},{"$f":"Winter!E72","v":0.88098073091710172},{"$f":"Winter!F72","v":0.97220162220878059},{"$f":"Winter!G72","v":0.85591422022620711},{"$f":"Winter!H72","v":1.1021006809899323},{"$f":"Winter!I72","v":0.75098080125358246},null,null,50]
[null,null,"Tagesertrag kWh >",{"$f":"Winter!D73","v":7.5468704443762524},{"$f":"Winter!E73","v":6.6073554818782627},{"$f":"Winter!F73","v":7.2915121665658544},{"$f":"Winter!G73","v":6.4193566516965532},{"$f":"Winter!H73","v":8.2657551074244928},{"$f":"Winter!I73","v":5.6323560094018683},null,"Eingaben Winter",null,null,"kWh der Tageseinstrahlung bei mittlerer Bewölkung"]
[null,null,"Puffererwärmung >",{"$f":"Winter!D74","v":4.3260936912446279},{"$f":"Winter!E74","v":3.7875353865739543},{"$f":"Winter!F74","v":4.1797146268649206},{"$f":"Winter!G74","v":3.6797687885907444},{"$f":"Winter!H74","v":4.7381800558466569},{"$f":"Winter!I74","v":3.2286362908580504},null,"GBS zu Datum (W/m²)",{"$f":"L9","v":"2013-12-21"},null,"kWh der Tageseinstrahlung"]
[null,null,null,null,null,null,null,null,null,null,"Strahlung   0°",{"$f":"L10/100*$L$79","v":300.2},null,{"$f":"L82","v":300.2},{"$f":"IF(N82>0,N82/1000,0)","v":0.30019999999999997},{"$f":"O82*($L$18/15)","v":0.15009999999999998}]
["Winter mittel bewölkt",null,"KW Schnitt >",{"$f":"Winter!D101","v":0.47363279770740013},{"$f":"Winter!E101","v":0.39351640099246399},{"$f":"Winter!F101","v":0.45073292786759578},{"$f":"Winter!G101","v":0.37513866785628919},{"$f":"Winter!H101","v":0.67798427533551042},{"$f":"Winter!I101","v":0.41217880964594583},null,"Strahlung 10°","1900-10-18T14:24:00",null,292.60000000000002,0.29260000000000003,{"$f":"O83*($L$18/15)*2","v":0.29260000000000003}]
[null,null,"Tagesertrag kWh >",{"$f":"Winter!D102","v":3.5522459828055011},{"$f":"Winter!E102","v":2.9513730074434799},{"$f":"Winter!F102","v":3.3804969590069684},{"$f":"Winter!G102","v":2.8135400089221689},{"$f":"Winter!H102","v":5.0848820650163278},{"$f":"Winter!I102","v":3.0913410723445938},null,"Strahlung 20°",252.70000000000002,null,252.70000000000002,0.25270000000000004,0.25270000000000004]
[null,null,"Puffererwärmung >",{"$f":"Winter!D103","v":2.0362545043310409},{"$f":"Winter!E103","v":1.6918159973880653},{"$f":"Winter!F103","v":1.9378027853293027},{"$f":"Winter!G103","v":1.6128059667080361},{"$f":"Winter!H103","v":2.9148077185533552},{"$f":"Winter!I103","v":1.7720499124933184},null,"Strahlung 30°",200.92500000000001,null,200.92500000000001,0.20092500000000002,0.20092500000000002]
[null,null,null,null,null,null,null,null,null,null,"Strahlung 40°",120.65,null,120.65,0.12065000000000001,0.12065000000000001]
["Winter stark bewölkt",null,"KW Schnitt >",{"$f":"Winter!D130","v":2.8607828040000047E-2},{"$f":"Winter!E130","v":4.2996158454106544E-3},{"$f":"Winter!F130","v":2.1121633811846691E-2},{"$f":"Winter!G130","v":2.9327847619047058E-4},{"$f":"Winter!H130","v":0.26632956501442184},{"$f":"Winter!I130","v":9.3926260510143578E-2},null,"Strahlung 50°","1900-02-14T14:24:00",null,45.6,4.5600000000000002E-2,4.5600000000000002E-2]
[null,null,"Tagesertrag kWh >",{"$f":"Winter!D131","v":0.21455871030000034},{"$f":"Winter!E131","v":3.2247118840579909E-2},{"$f":"Winter!F131","v":0.15841225358885019},{"$f":"Winter!G131","v":2.1995885714285292E-3},{"$f":"Winter!H131","v":1.9974717376081639},{"$f":"Winter!I131","v":0.7044469538260768},null,"Strahlung 60°",0,null,0,0,0]
[null,null,"Puffererwärmung >",{"$f":"Winter!D132","v":0.12299152209802255},{"$f":"Winter!E132","v":1.8485020831516142E-2},{"$f":"Winter!F132","v":9.080668018850685E-2},{"$f":"Winter!G132","v":1.260870490930656E-3},{"$f":"Winter!H132","v":1.1450110275770502},{"$f":"Winter!I132","v":0.40381023435143415},null,"Strahlung 70°",0,null,0,0,0]
[null,null,null,null,null,null,null,null,null,null,"Laufzeit gesamt (Std.) > ",{"$f":"L18","v":7.5},null,null,null,{"$f":"SUM(P82:P89)*$B$6","v":11.114534500000001},{"$f":"P90/$B$6","v":1.062575},"kWh/m²"]
["theoretischer max. Ertrag ! >  ",null,{"$f":"Jahreshochrechnung!C8","v":"Summe Sommer (kWh)>"},{"$f":"Jahreshochrechnung!D8","v":2597.5751745200751},{"$f":"Jahreshochrechnung!E8","v":2411.8077372721687},{"$f":"Jahreshochrechnung!F8","v":2569.6763518944003},{"$f":"Jahreshochrechnung!G8","v":2394.0282227571215},{"$f":"Jahreshochrechnung!H8","v":2458.8555861771697},{"$f":"Jahreshochrechnung!I8","v":2017.9564495921693},null,"Eingaben Frühjahr/Herbst"]
[null,null,{"$f":"Jahreshochrechnung!C13","v":"Summe Frühj./Herbst (kWh)>"},{"$f":"Jahreshochrechnung!D13","v":4707.6603115362441},{"$f":"Jahreshochrechnung!E13","v":4295.7090546465179},{"$f":"Jahreshochrechnung!F13","v":4615.1012437280669},{"$f":"Jahreshochrechnung!G13","v":4242.7193497844974},{"$f":"Jahreshochrechnung!H13","v":4629.5045995835817},{"$f":"Jahreshochrechnung!I13","v":3655.073570132548},null,"GBS zu Datum (W/m²)",{"$f":"L20","v":"2013-09-23"}]
[null,null,{"$f":"Jahreshochrechnung!C18","v":"Summe Winter (kWh)>"},{"$f":"Jahreshochrechnung!D18","v":235.81415681671598},{"$f":"Jahreshochrechnung!E18","v":197.86917152314905},{"$f":"Jahreshochrechnung!F18","v":225.14024887102056},{"$f":"Jahreshochrechnung!G18","v":190.69840792627082},{"$f":"Jahreshochrechnung!H18","v":365.97862362632134},{"$f":"Jahreshochrechnung!I18","v":209.68886071003556},null,"Strahlung   0°",{"$f":"L21/100*$L$79","v":471},null,{"$f":"L93","v":471},{"$f":"IF(N93>0,N93/1000,0)","v":0.47099999999999997},{"$f":"O93*($L$29/15)","v":0.26689999999999997}]
[null,null,{"$f":"Jahreshochrechnung!C19","v":"Jahresertrag (kWh) >"},{"$f":"Jahreshochrechnung!D19","v":7541.0496428730348},{"$f":"Jahreshochrechnung!E19","v":6905.385963441835},{"$f":"Jahreshochrechnung!F19","v":7409.9178444934878},{"$f":"Jahreshochrechnung!G19","v":6827.44598046789},{"$f":"Jahreshochrechnung!H19","v":7454.3388093870735},{"$f":"Jahreshochrechnung!I19","v":5882.7188804347525},null,"Strahlung 10°",465.5,null,465.5,0.46550000000000002,{"$f":"O94*($L$29/15)*2","v":0.52756666666666663}]
[null,null,{"$f":"Jahreshochrechnung!C20","v":"Leistung Jahresertrag (%) >"},{"$f":"Jahreshochrechnung!D20","v":99.999999999999986},{"$f":"Jahreshochrechnung!E20","v":91.57062067570449},{"$f":"Jahreshochrechnung!F20","v":98.261093553422256},{"$f":"Jahreshochrechnung!G20","v":90.537077778296222},{"$f":"Jahreshochrechnung!H20","v":98.850149016484579},{"$f":"Jahreshochrechnung!I20","v":78.009284635786031},null,"Strahlung 20°",{"$f":"L23/100*$L$79","v":448.50000000000006},null,448.50000000000006,0.44850000000000007,0.50830000000000009]
[null,null,{"$f":"C18","v":"Kollektor > "},"SolRose 26","Synergie 210","Sunex AMX 2,85","Sunex 2,0","Star Azzurro CPC","Billig VRK",null,"Strahlung 30°",{"$f":"L24/100*$L$79","v":417},null,417,0.41699999999999998,0.47259999999999996]
["Übersicht ! (nutzbarer Jahreszeitenertrag und hoch gerechneter Jahresertrag bei verschiedenen Bedingungen je nach Einstellungen der Kollektorfläche und Differenz)"]
["nutzbarer Realertrag !  >  ",null,{"$f":"C91","v":"Summe Sommer (kWh)>"},{"$f":"Amortisation!B16","v":843},{"$f":"Amortisation!B17","v":843},{"$f":"Amortisation!B18","v":843},{"$f":"Amortisation!B19","v":843},{"$f":"Amortisation!B20","v":843},{"$f":"Amortisation!B21","v":843}]
[null,null,{"$f":"C92","v":"Summe Frühj./Herbst (kWh)>"},{"$f":"Amortisation!C16","v":4707.6603115362441},{"$f":"Amortisation!C17","v":4295.7090546465179},{"$f":"Amortisation!C18","v":4615.1012437280669},{"$f":"Amortisation!C19","v":4242.7193497844974},{"$f":"Amortisation!C20","v":4629.5045995835817},{"$f":"Amortisation!C21","v":3655.073570132548}]
[null,null,"Summe Winter (kWh)>",{"$f":"Amortisation!E16","v":235.81415681671598},{"$f":"Amortisation!E17","v":197.86917152314905},{"$f":"Amortisation!E18","v":225.14024887102056},{"$f":"Amortisation!E19","v":190.69840792627082},{"$f":"Amortisation!E20","v":365.97862362632134},{"$f":"Amortisation!E21","v":209.68886071003556}]
[null,null,"Jahresertrag /m² >",{"$f":"Amortisation!B8","v":553.20023598020646},{"$f":"Amortisation!B9","v":510.18912296077116},{"$f":"Amortisation!B10","v":543.330926634712},{"$f":"Amortisation!B11","v":504.43764414060882},{"$f":"Amortisation!B12","v":558.17239227628136},{"$f":"Amortisation!B13","v":450.07289013791427}]
[null,null,"Jahresdeckung (%) >",{"$f":"(D100+D99+D98)/(Amortisation!$F$4/100)","v":30.600076511649711},{"$f":"(E100+E99+E98)/(Amortisation!$F$4/100)","v":28.220931920516485},{"$f":"(F100+F99+F98)/(Amortisation!$F$4/100)","v":30.054159135902104},{"$f":"(G100+G99+G98)/(Amortisation!$F$4/100)","v":27.902790892177517},{"$f":"(H100+H99+H98)/(Amortisation!$F$4/100)","v":30.875109588629844},{"$f":"(I100+I99+I98)/(Amortisation!$F$4/100)","v":24.895623642742379}]
[null,null,{"$f":"C96","v":"Kollektor > "},{"$f":"D96","v":"SolRose 26"},"Synergie 210","Sunex AMX 2,85","Sunex 2,0","Star Azzurro CPC","Billig VRK"]
[null,null,"Amortisationsberechnung nach nutzbaren Ertrag (nach eingetragenen Vorgaben) bei verschiedenen Preisentwicklungen !",null,null,null,null,null,null,null,"Strahlung 40°",{"$f":"L25/100*$L$79","v":372},null,372,0.372,0.42159999999999997]
["Amortisation (J) >  ",null,{"$f":"Amortisation!F22","v":"Kollektorbez."},{"$f":"Amortisation!G23","v":"Jahre bei aktuellen Preis "},{"$f":"Amortisation!H23","v":"Jahre leichter Anstieg "},{"$f":"Amortisation!I23","v":"Jahre mittlerer Anstieg "},{"$f":"Amortisation!J23","v":"Jahre hoher Anstieg "},"Anlagenpreis (Euro)",null,null,"Strahlung 50°",{"$f":"L26/100*$L$79","v":328.5},null,328.5,0.32850000000000001,0.37230000000000002]
[null,null,{"$f":"Amortisation!F24","v":"SolRose 26"},{"$f":"IF($D$17>0,Amortisation!G24,\"\")","v":""},{"$f":"IF($D$17>0,Amortisation!H24,\"\")","v":""},{"$f":"IF($D$17>0,Amortisation!I24,\"\")","v":""},{"$f":"IF($D$17>0,Amortisation!J24,\"\")","v":""},{"$f":"Amortisation!K24","v":8000},null,null,"Strahlung 60°",{"$f":"L27/100*$L$79","v":262},null,262,0.26200000000000001,0.29693333333333333]
[null,null,{"$f":"Amortisation!F25","v":"Synergie 210"},{"$f":"IF($E$17>0,Amortisation!G25,\"\")","v":20.034516533756729},{"$f":"IF($E$17>0,Amortisation!H25,\"\")","v":17.925620056519179},{"$f":"IF($E$17>0,Amortisation!I25,\"\")","v":14.191115878077685},{"$f":"IF($E$17>0,Amortisation!J25,\"\")","v":11.352892702462148},{"$f":"Amortisation!K25","v":9087.84},null,null,"Strahlung 70°",{"$f":"L28/100*$L$79","v":164},null,164,0.16400000000000001,0.18586666666666668]
[null,null,{"$f":"Amortisation!F26","v":"Sunex AMX 2,85"},{"$f":"IF($F$17>0,Amortisation!G26,\"\")","v":""},{"$f":"IF($F$17>0,Amortisation!H26,\"\")","v":""},{"$f":"IF($F$17>0,Amortisation!I26,\"\")","v":""},{"$f":"IF($F$17>0,Amortisation!J26,\"\")","v":""},{"$f":"Amortisation!K26","v":8000},null,null,"Laufzeit gesamt (Std.) > ",{"$f":"L29","v":8.5},null,null,null,{"$f":"SUM(P93:P107)*$B$6","v":31.924617333333337},{"$f":"P108/$B$6","v":3.0520666666666667},"kWh/m²"]
[null,null,{"$f":"Amortisation!F27","v":"Sunex 2,0"},{"$f":"IF($G$17>0,Amortisation!G27,\"\")","v":20.985940332998915},{"$f":"IF($G$17>0,Amortisation!H27,\"\")","v":18.776893982156924},{"$f":"IF($G$17>0,Amortisation!I27,\"\")","v":14.865041069207567},{"$f":"IF($G$17>0,Amortisation!J27,\"\")","v":11.892032855366052},{"$f":"Amortisation!K27","v":9412.1},null,null,"Eingaben Sommer"]
[null,null,{"$f":"Amortisation!F28","v":"Star Azzurro CPC"},{"$f":"IF($H$17>0,Amortisation!G28,\"\")","v":29.820396102332307},{"$f":"IF($H$17>0,Amortisation!H28,\"\")","v":26.681407038928906},{"$f":"IF($H$17>0,Amortisation!I28,\"\")","v":21.122780572485386},{"$f":"IF($H$17>0,Amortisation!J28,\"\")","v":16.898224457988309},{"$f":"Amortisation!K28","v":14799},null,null,"Strahlung   0°",{"$f":"L32/100*$L$79","v":496.5},null,{"$f":"L110","v":496.5},{"$f":"IF(N110>0,N110/1000,0)","v":0.4965},{"$f":"O110*($L$40/15)","v":0.19529000000000002}]
[null,null,{"$f":"Amortisation!F29","v":"Billig VRK"},{"$f":"IF($I$17>0,Amortisation!G29,\"\")","v":25.690436245439201},{"$f":"IF($I$17>0,Amortisation!H29,\"\")","v":22.986179798550868},{"$f":"IF($I$17>0,Amortisation!I29,\"\")","v":18.197392340519439},{"$f":"IF($I$17>0,Amortisation!J29,\"\")","v":14.557913872415552},{"$f":"Amortisation!K29","v":10280.280000000001},null,null,"Strahlung 10°",495,null,495,0.495,{"$f":"O111*($L$40/15)*2","v":0.38940000000000002}]
[null,null,null,null,null,null,null,null,null,null,"Strahlung 20°",488.5,null,488.5,0.48849999999999999,0.38428666666666667]
[null,null,null,null,null,null,null,null,null,null,"Strahlung 30°",{"$f":"L35/100*$L$79","v":477.50000000000006},null,477.50000000000006,0.47750000000000004,0.37563333333333337]
[null,null,null,null,null,null,null,null,null,null,"Strahlung 40°",{"$f":"L36/100*$L$79","v":459.99999999999994},null,459.99999999999994,0.45999999999999996,0.36186666666666667]
[null,null,null,null,null,null,null,null,null,null,"Strahlung 50°",{"$f":"L37/100*$L$79","v":432.5},null,432.5,0.4325,0.34023333333333339]
[null,null,null,null,null,null,null,null,null,null,"Strahlung 60°",{"$f":"L38/100*$L$79","v":393},null,393,0.39300000000000002,0.30916000000000005]
[null,null,null,null,null,null,null,null,null,null,"Strahlung 70°",{"$f":"L39/100*$L$79","v":336.5},null,336.5,0.33650000000000002,0.26471333333333336]
[null,null,null,null,null,null,null,null,null,null,"Laufzeit gesamt (Std.) > ",{"$f":"L40","v":5.9},null,null,null,{"$f":"SUM(P110:P117)*$B$6","v":27.411301666666667},{"$f":"P118/$B$6","v":2.6205833333333333},"kWh/m²"]
[]
[null,null,null,null,null,null,null,null,null,null,"Strahlung bei starker Bewölkung","Faktor (%)"]
[null,null,null,null,null,null,null,null,null,null,null,25]
[null,null,null,null,null,null,null,null,null,null,"Eingaben Winter",null,null,"kWh der Tageseinstrahlung bei starker Bewölkung"]
[null,null,null,null,null,null,null,null,null,null,"GBS zu Datum (W/m²)",{"$f":"L9","v":"2013-12-21"},null,"kWh der Tageseinstrahlung"]
[null,null,null,null,null,null,null,null,null,null,"Strahlung   0°",{"$f":"L10/100*$L$121","v":150.1},null,{"$f":"L124","v":150.1},{"$f":"IF(N124>0,N124/1000,0)","v":0.15009999999999998},{"$f":"O124*($L$18/15)","v":7.5049999999999992E-2}]
[null,null,null,null,null,null,null,null,null,null,"Strahlung 10°",146.30000000000001,null,146.30000000000001,0.14630000000000001,{"$f":"O125*($L$18/15)*2","v":0.14630000000000001}]
[null,null,null,null,null,null,null,null,null,null,"Strahlung 20°",126.35000000000001,null,126.35000000000001,0.12635000000000002,0.12635000000000002]
[null,null,null,null,null,null,null,null,null,null,"Strahlung 30°",100.46250000000001,null,100.46250000000001,0.10046250000000001,0.10046250000000001]
[null,null,null,null,null,null,null,null,null,null,"Strahlung 40°",60.325000000000003,null,60.325000000000003,6.0325000000000004E-2,6.0325000000000004E-2]
[null,null,null,null,null,null,null,null,null,null,"Strahlung 50°",22.8,null,22.8,2.2800000000000001E-2,2.2800000000000001E-2]
[null,null,null,null,null,null,null,null,null,null,"Strahlung 60°",0,null,0,0,0]
[null,null,null,null,null,null,null,null,null,null,"Strahlung 70°",0,null,0,0,0]
[null,null,null,null,null,null,null,null,null,null,"Laufzeit gesamt (Std.) > ",{"$f":"L18","v":7.5},null,null,null,{"$f":"SUM(P124:P131)*$B$6","v":5.5572672500000007},{"$f":"P132/$B$6","v":0.53128750000000002},"kWh/m²"]
[null,null,null,null,null,null,null,null,null,null,"Eingaben Frühjahr/Herbst"]
[null,null,null,null,null,null,null,null,null,null,"GBS zu Datum (W/m²)",{"$f":"L20","v":"2013-09-23"}]
[null,null,null,null,null,null,null,null,null,null,"Strahlung   0°",{"$f":"L21/100*$L$121","v":235.5},null,{"$f":"L135","v":235.5},{"$f":"IF(N135>0,N135/1000,0)","v":0.23549999999999999},{"$f":"O135*($L$29/15)","v":0.13344999999999999}]
[null,null,null,null,null,null,null,null,null,null,"Strahlung 10°",232.75,null,232.75,0.23275000000000001,{"$f":"O136*($L$29/15)*2","v":0.26378333333333331}]
[null,null,null,null,null,null,null,null,null,null,"Strahlung 20°",224.25000000000003,null,224.25000000000003,0.22425000000000003,0.25415000000000004]
[null,null,null,null,null,null,null,null,null,null,"Strahlung 30°",208.5,null,208.5,0.20849999999999999,0.23629999999999998]
[null,null,null,null,null,null,null,null,null,null,"Strahlung 40°",186,null,186,0.186,0.21079999999999999]
[null,null,null,null,null,null,null,null,null,null,"Strahlung 50°",164.25,null,164.25,0.16425000000000001,0.18615000000000001]
[null,null,null,null,null,null,null,null,null,null,"Strahlung 60°",131,null,131,0.13100000000000001,0.14846666666666666]
[null,null,null,null,null,null,null,null,null,null,"Strahlung 70°",82,null,82,8.2000000000000003E-2,9.293333333333334E-2]
[null,null,null,null,null,null,null,null,null,null,"Laufzeit gesamt (Std.) > ",{"$f":"L29","v":8.5},null,null,null,{"$f":"SUM(P135:P142)*$B$6","v":15.962308666666669},{"$f":"P143/$B$6","v":1.5260333333333334},"kWh/m²"]
[null,null,null,null,null,null,null,null,null,null,"Eingaben Sommer"]
[null,null,null,null,null,null,null,null,null,null,"GBS zu Datum (W/m²)",{"$f":"L31","v":"2013-06-21"}]
[null,null,null,null,null,null,null,null,null,null,"Strahlung   0°",{"$f":"L32/100*$L$121","v":248.25},null,{"$f":"L146","v":248.25},{"$f":"IF(N146>0,N146/1000,0)","v":0.24825},{"$f":"O146*($L$40/15)","v":9.764500000000001E-2}]
[null,null,null,null,null,null,null,null,null,null,"Strahlung 10°",247.5,null,247.5,0.2475,{"$f":"O147*($L$40/15)*2","v":0.19470000000000001}]
[null,null,null,null,null,null,null,null,null,null,"Strahlung 20°",244.25,null,244.25,0.24424999999999999,0.19214333333333333]
[null,null,null,null,null,null,null,null,null,null,"Strahlung 30°",238.75000000000003,null,238.75000000000003,0.23875000000000002,0.18781666666666669]
[null,null,null,null,null,null,null,null,null,null,"Strahlung 40°",229.99999999999997,null,229.99999999999997,0.22999999999999998,0.18093333333333333]
[null,null,null,null,null,null,null,null,null,null,"Strahlung 50°",216.25,null,216.25,0.21625,0.17011666666666669]
[null,null,null,null,null,null,null,null,null,null,"Strahlung 60°",196.5,null,196.5,0.19650000000000001,0.15458000000000002]
[null,null,null,null,null,null,null,null,null,null,"Strahlung 70°",168.25,null,168.25,0.16825000000000001,0.13235666666666668]
[null,null,null,null,null,null,null,null,null,null,"Laufzeit gesamt (Std.) > ",{"$f":"L40","v":5.9},null,null,null,{"$f":"SUM(P146:P153)*$B$6","v":13.705650833333333},{"$f":"P154/$B$6","v":1.3102916666666666},"kWh/m²"]

{"sheet":"Herbstfrühjahr","index":1,"n_rows":132,"n_cols":9,"rows_kept":132,"cut":false,"hidden":false,"merged":[[116,0,116,1],[117,0,117,1],[118,0,118,1],[119,0,119,1],[120,0,120,1],[112,0,112,2],[103,2,103,6],[113,0,113,1],[114,0,114,1],[115,0,115,1],[107,0,107,2],[108,0,108,2],[109,0,109,2],[110,0,110,2],[111,0,111,2],[126,0,126,1],[127,0,127,1],[128,0,128,1],[129,0,129,2],[130,0,130,2],[121,0,121,1],[122,0,122,1],[123,0,123,1],[124,0,124,1],[125,0,125,1],[100,0,100,2],[101,0,101,2],[104,0,104,2],[105,0,105,2],[106,0,106,2],[95,0,95,1],[96,0,96,1],[97,0,97,1],[98,0,98,1],[99,0,99,1],[90,0,90,1],[91,0,91,1],[92,0,92,1],[93,0,93,1],[94,0,94,1],[85,0,85,1],[86,0,86,1],[87,0,87,1],[88,0,88,1],[89,0,89,1],[81,0,81,2],[82,0,82,2],[83,0,83,2],[74,2,74,6],[84,0,84,1],[76,0,76,2],[77,0,77,2],[78,0,78,2],[79,0,79,2],[80,0,80,2],[75,0,75,2],[54,0,54,2],[45,2,45,6],[69,0,69,1],[70,0,70,1],[71,0,71,2],[72,0,72,2],[64,0,64,1],[65,0,65,1],[66,0,66,1],[67,0,67,1],[68,0,68,1],[31,0,31,1],[32,0,32,1],[62,0,62,1],[63,0,63,1],[55,0,55,1],[56,0,56,1],[57,0,57,1],[58,0,58,1],[59,0,59,1],[46,0,46,2],[38,0,38,1],[39,0,39,1],[40,0,40,1],[41,0,41,1],[43,0,43,2],[60,0,60,1],[61,0,61,1],[47,0,47,2],[48,0,48,2],[49,0,49,2],[50,0,50,2],[51,0,51,2],[52,0,52,2],[53,0,53,2],[0,0,0,8],[42,0,42,2],[23,0,23,2],[24,0,24,2],[25,0,25,2],[2,0,3,1],[22,0,22,2],[21,0,21,2],[20,0,20,2],[19,0,19,2],[18,0,18,2],[6,0,6,1],[17,0,17,2],[16,2,16,6],[27,0,27,1],[26,0,26,1],[33,0,33,1],[34,0,34,1],[35,0,35,1],[36,0,36,1],[37,0,37,1],[28,0,28,1],[29,0,29,1],[30,0,30,1]]}
["Solartirol Tool     Herbst/Frühjahr                   Berechnung eines Tagesverlaufes mit IAM (Beispielort Breitengrad 48,8 Kollektorneigung 50°, Strahlung mit Getsolar ermittelt)"]
[null,null,"Infos > ",{"$f":"Eingaben!D2","v":0},{"$f":"Eingaben!E2","v":0},{"$f":"Eingaben!F2","v":0},{"$f":"Eingaben!G2","v":0},{"$f":"Eingaben!H2","v":0},{"$f":"Eingaben!I2","v":0}]
[null,null,"Kollektor > ",{"$f":"Eingaben!D3","v":"SolRose 26"},{"$f":"Eingaben!E3","v":"Synergie 210"},{"$f":"Eingaben!F3","v":"Sunex AMX 2,85"},{"$f":"Eingaben!G3","v":"Sunex 2,0"},{"$f":"Eingaben!H3","v":"Star Azzurro CPC"},{"$f":"Eingaben!I3","v":"Billig VRK"}]
[null,null,"Bruttofl.(m²)",{"$f":"Eingaben!D4","v":2.6},{"$f":"Eingaben!E4","v":2.0699999999999998},{"$f":"Eingaben!F4","v":2.87},{"$f":"Eingaben!G4","v":2.0299999999999998},{"$f":"Eingaben!H4","v":3.92},{"$f":"Eingaben!I4","v":4.18}]
["Berechnung zu Diff.",{"$f":"Eingaben!B4","v":32},"Aperturfl. (m²)",{"$f":"Eingaben!D5","v":2.4700000000000002},{"$f":"Eingaben!E5","v":1.92},{"$f":"Eingaben!F5","v":2.67},{"$f":"Eingaben!G5","v":1.84},{"$f":"Eingaben!H5","v":3.47},{"$f":"Eingaben!I5","v":2.84}]
[" Gesamtfläche (m²)",{"$f":"Eingaben!B6","v":10.46},"η0",{"$f":"Eingaben!D6","v":0.81},{"$f":"Eingaben!E6","v":0.78500000000000003},{"$f":"Eingaben!F6","v":0.82},{"$f":"Eingaben!G6","v":0.8},{"$f":"Eingaben!H6","v":0.64},{"$f":"Eingaben!I6","v":0.65400000000000003}]
["Strahlungseingaben zu Datum",null,"a1",{"$f":"Eingaben!D7","v":3.36},{"$f":"Eingaben!E7","v":3.722},{"$f":"Eingaben!F7","v":3.29},{"$f":"Eingaben!G7","v":4.16},{"$f":"Eingaben!H7","v":0.749},{"$f":"Eingaben!I7","v":1.82}]
["GBS zu Datum (W/m²)",{"$f":"Eingaben!L20","v":"2013-09-23"},"a2",{"$f":"Eingaben!D8","v":1.41E-2},{"$f":"Eingaben!E8","v":1.2E-2},{"$f":"Eingaben!F8","v":2.3E-2},{"$f":"Eingaben!G8","v":4.0000000000000001E-3},{"$f":"Eingaben!H8","v":5.0000000000000001E-3},{"$f":"Eingaben!I8","v":6.6E-3}]
["Strahlung   0°",{"$f":"Eingaben!L21","v":942},"IAM 0°",{"$f":"Eingaben!D9","v":1},{"$f":"Eingaben!E9","v":1},{"$f":"Eingaben!F9","v":1},{"$f":"Eingaben!G9","v":1},{"$f":"Eingaben!H9","v":1},{"$f":"Eingaben!I9","v":1}]
["Strahlung 10°",{"$f":"Eingaben!L22","v":931},"IAM 10°",{"$f":"Eingaben!D10","v":1},{"$f":"Eingaben!E10","v":1},{"$f":"Eingaben!F10","v":1},{"$f":"Eingaben!G10","v":1},{"$f":"Eingaben!H10","v":1.01},{"$f":"Eingaben!I10","v":1}]
["Strahlung 20°",{"$f":"Eingaben!L23","v":897.00000000000011},"IAM 20°",{"$f":"Eingaben!D11","v":1},{"$f":"Eingaben!E11","v":0.99},{"$f":"Eingaben!F11","v":0.99},{"$f":"Eingaben!G11","v":0.99},{"$f":"Eingaben!H11","v":1.01},{"$f":"Eingaben!I11","v":1.04}]
["Strahlung 30°",{"$f":"Eingaben!L24","v":834},"IAM 30°",{"$f":"Eingaben!D12","v":0.99},{"$f":"Eingaben!E12","v":0.98},{"$f":"Eingaben!F12","v":0.98},{"$f":"Eingaben!G12","v":0.98},{"$f":"Eingaben!H12","v":1.02},{"$f":"Eingaben!I12","v":1.1499999999999999}]
["Strahlung 40°",{"$f":"Eingaben!L25","v":744},"IAM 40°",{"$f":"Eingaben!D13","v":0.96},{"$f":"Eingaben!E13","v":0.97},{"$f":"Eingaben!F13","v":0.97},{"$f":"Eingaben!G13","v":0.97},{"$f":"Eingaben!H13","v":1.02},{"$f":"Eingaben!I13","v":1.3}]
["Strahlung 50°",{"$f":"Eingaben!L26","v":657},"IAM 50°",{"$f":"Eingaben!D14","v":0.94},{"$f":"Eingaben!E14","v":0.94},{"$f":"Eingaben!F14","v":0.94},{"$f":"Eingaben!G14","v":0.95},{"$f":"Eingaben!H14","v":0.98},{"$f":"Eingaben!I14","v":1.36}]
["Strahlung 60°",{"$f":"Eingaben!L27","v":524},"IAM 60°",{"$f":"Eingaben!D15","v":0.86},{"$f":"Eingaben!E15","v":0.9},{"$f":"Eingaben!F15","v":0.9},{"$f":"Eingaben!G15","v":0.9},{"$f":"Eingaben!H15","v":1.05},{"$f":"Eingaben!I15","v":1.34}]
["Strahlung 70°",{"$f":"Eingaben!L28","v":328},"IAM 70°",{"$f":"Eingaben!D16","v":0.73},{"$f":"Eingaben!E16","v":0.8},{"$f":"Eingaben!F16","v":0.81},{"$f":"Eingaben!G16","v":0.81},{"$f":"Eingaben!H16","v":1.1399999999999999},{"$f":"Eingaben!I16","v":1.1100000000000001}]
["Laufzeit gesamt (Std.) > ",{"$f":"Eingaben!L29","v":8.5},{"$f":"\"Berechnung nach Tagesverlauf bei Sonne (mit IAM) mit Diff. \"&B5&\"  bei  \"&B6&\" m²\"&\"  am \"","v":"Berechnung nach Tagesverlauf bei Sonne (mit IAM) mit Diff. 32  bei  10,46 m²  am "},null,null,null,null,{"$f":"B8","v":"2013-09-23"}]
["Tageswirkungsgrad bei Sonne (%) > ",null,null,{"$f":"IF(D44>0,D44/(Eingaben!$M$3/100),\"\")","v":58.514143512811003},{"$f":"IF(E44>0,E44/(Eingaben!$M$3/100),\"\")","v":54.014838082629687},{"$f":"IF(F44>0,F44/(Eingaben!$M$3/100),\"\")","v":57.645776418667047},{"$f":"IF(G44>0,G44/(Eingaben!$M$3/100),\"\")","v":53.484469825985656},{"$f":"IF(H44>0,H44/(Eingaben!$M$3/100),\"\")","v":54.102216646331762},{"$f":"IF(I44>0,I44/(Eingaben!$M$3/100),\"\")","v":44.107286415072224}]
["Wirkungsgrad bei eingestellter Diff. bei   0° >",null,null,{"$f":"IF($B$9>0,($D$6-$D$7*($B$5/$B$9)-$D$8*$B$9*(($B$5/$B$9*$B$5/$B$9)))*$D$9,0)","v":0.68053248407643319},{"$f":"IF($B$9>0,($E$6-$E$7*($B$5/$B$9)-$E$8*$B$9*(($B$5/$B$9*$B$5/$B$9)))*$E$9,0)","v":0.6455180467091296},{"$f":"IF($B$9>0,($F$6-$F$7*($B$5/$B$9)-$F$8*$B$9*(($B$5/$B$9*$B$5/$B$9)))*$F$9,0)","v":0.6832356687898089},{"$f":"IF($B$9>0,($G$6-$G$7*($B$5/$B$9)-$G$8*$B$9*(($B$5/$B$9*$B$5/$B$9)))*$G$9,0)","v":0.65433545647558389},{"$f":"IF($B$9>0,($H$6-$H$7*($B$5/$B$9)-$H$8*$B$9*(($B$5/$B$9*$B$5/$B$9)))*$H$9,0)","v":0.60912101910828031},{"$f":"IF($B$9>0,($I$6-$I$7*($B$5/$B$9)-$I$8*$B$9*(($B$5/$B$9*$B$5/$B$9)))*$I$9,0)","v":0.5849995753715499}]
["Wirkungsgrad bei eingestellter Diff. bei 10° >",null,null,{"$f":"IF($B$10>0,($D$6-$D$7*($B$5/$B$10)-$D$8*$B$10*(($B$5/$B$10*$B$5/$B$10)))*$D$10,0)","v":0.67900279269602581},{"$f":"IF($B$10>0,($E$6-$E$7*($B$5/$B$10)-$E$8*$B$10*(($B$5/$B$10*$B$5/$B$10)))*$E$10,0)","v":0.64387003222341577},{"$f":"IF($B$10>0,($F$6-$F$7*($B$5/$B$10)-$F$8*$B$10*(($B$5/$B$10*$B$5/$B$10)))*$F$10,0)","v":0.6816197636949517},{"$f":"IF($B$10>0,($G$6-$G$7*($B$5/$B$10)-$G$8*$B$10*(($B$5/$B$10*$B$5/$B$10)))*$G$10,0)","v":0.65261439312567138},{"$f":"IF($B$10>0,($H$6-$H$7*($B$5/$B$10)-$H$8*$B$10*(($B$5/$B$10*$B$5/$B$10)))*$H$10,0)","v":0.61484373791621905},{"$f":"IF($B$10>0,($I$6-$I$7*($B$5/$B$10)-$I$8*$B$10*(($B$5/$B$10*$B$5/$B$10)))*$I$10,0)","v":0.58418431793770143}]
["Wirkungsgrad bei eingestellter Diff. bei 20° >",null,null,{"$f":"IF($B$11>0,($D$6-$D$7*($B$5/$B$11)-$D$8*$B$11*(($B$5/$B$11*$B$5/$B$11)))*$D$11,0)","v":0.67403745819398009},{"$f":"IF($B$11>0,($E$6-$E$7*($B$5/$B$11)-$E$8*$B$11*(($B$5/$B$11*$B$5/$B$11)))*$E$11,0)","v":0.63213541806020068},{"$f":"IF($B$11>0,($F$6-$F$7*($B$5/$B$11)-$F$8*$B$11*(($B$5/$B$11*$B$5/$B$11)))*$F$11,0)","v":0.66961083612040129},{"$f":"IF($B$11>0,($G$6-$G$7*($B$5/$B$11)-$G$8*$B$11*(($B$5/$B$11*$B$5/$B$11)))*$G$11,0)","v":0.64055759197324424},{"$f":"IF($B$11>0,($H$6-$H$7*($B$5/$B$11)-$H$8*$B$11*(($B$5/$B$11*$B$5/$B$11)))*$H$11,0)","v":0.61364762541806028},{"$f":"IF($B$11>0,($I$6-$I$7*($B$5/$B$11)-$I$8*$B$11*(($B$5/$B$11*$B$5/$B$11)))*$I$11,0)","v":0.60479953623188398}]
["Wirkungsgrad bei eingestellter Diff. bei 30° >",null,null,{"$f":"IF($B$12>0,($D$6-$D$7*($B$5/$B$12)-$D$8*$B$12*(($B$5/$B$12*$B$5/$B$12)))*$D$12,0)","v":0.65712923741007212},{"$f":"IF($B$12>0,($E$6-$E$7*($B$5/$B$12)-$E$8*$B$12*(($B$5/$B$12*$B$5/$B$12)))*$E$12,0)","v":0.6149065227817746},{"$f":"IF($B$12>0,($F$6-$F$7*($B$5/$B$12)-$F$8*$B$12*(($B$5/$B$12*$B$5/$B$12)))*$F$12,0)","v":0.65221467625899276},{"$f":"IF($B$12>0,($G$6-$G$7*($B$5/$B$12)-$G$8*$B$12*(($B$5/$B$12*$B$5/$B$12)))*$G$12,0)","v":0.62276297362110322},{"$f":"IF($B$12>0,($H$6-$H$7*($B$5/$B$12)-$H$8*$B$12*(($B$5/$B$12*$B$5/$B$12)))*$H$12,0)","v":0.6172247482014388},{"$f":"IF($B$12>0,($I$6-$I$7*($B$5/$B$12)-$I$8*$B$12*(($B$5/$B$12*$B$5/$B$12)))*$I$12,0)","v":0.6624739088729017}]
["Wirkungsgrad bei eingestellter Diff. bei 40° >",null,null,{"$f":"IF($B$13>0,($D$6-$D$7*($B$5/$B$13)-$D$8*$B$13*(($B$5/$B$13*$B$5/$B$13)))*$D$13,0)","v":0.62023432258064515},{"$f":"IF($B$13>0,($E$6-$E$7*($B$5/$B$13)-$E$8*$B$13*(($B$5/$B$13*$B$5/$B$13)))*$E$13,0)","v":0.5901459139784947},{"$f":"IF($B$13>0,($F$6-$F$7*($B$5/$B$13)-$F$8*$B$13*(($B$5/$B$13*$B$5/$B$13)))*$F$13,0)","v":0.62743354838709675},{"$f":"IF($B$13>0,($G$6-$G$7*($B$5/$B$13)-$G$8*$B$13*(($B$5/$B$13*$B$5/$B$13)))*$G$13,0)","v":0.59710279569892477},{"$f":"IF($B$13>0,($H$6-$H$7*($B$5/$B$13)-$H$8*$B$13*(($B$5/$B$13*$B$5/$B$13)))*$H$13,0)","v":0.6129212903225808},{"$f":"IF($B$13>0,($I$6-$I$7*($B$5/$B$13)-$I$8*$B$13*(($B$5/$B$13*$B$5/$B$13)))*$I$13,0)","v":0.73662752688172062}]
["Wirkungsgrad bei eingestellter Diff. bei 50° >",null,null,{"$f":"IF($B$14>0,($D$6-$D$7*($B$5/$B$14)-$D$8*$B$14*(($B$5/$B$14*$B$5/$B$14)))*$D$14,0)","v":0.58690852968036533},{"$f":"IF($B$14>0,($E$6-$E$7*($B$5/$B$14)-$E$8*$B$14*(($B$5/$B$14*$B$5/$B$14)))*$E$14,0)","v":0.54991144596651453},{"$f":"IF($B$14>0,($F$6-$F$7*($B$5/$B$14)-$F$8*$B$14*(($B$5/$B$14*$B$5/$B$14)))*$F$14,0)","v":0.58647415525114144},{"$f":"IF($B$14>0,($G$6-$G$7*($B$5/$B$14)-$G$8*$B$14*(($B$5/$B$14*$B$5/$B$14)))*$G$14,0)","v":0.5615902587519026},{"$f":"IF($B$14>0,($H$6-$H$7*($B$5/$B$14)-$H$8*$B$14*(($B$5/$B$14*$B$5/$B$14)))*$H$14,0)","v":0.58381150684931504},{"$f":"IF($B$14>0,($I$6-$I$7*($B$5/$B$14)-$I$8*$B$14*(($B$5/$B$14*$B$5/$B$14)))*$I$14,0)","v":0.75489232267884343}]
["Wirkungsgrad bei eingestellter Diff. bei 60° >",null,null,{"$f":"IF($B$15>0,($D$6-$D$7*($B$5/$B$15)-$D$8*$B$15*(($B$5/$B$15*$B$5/$B$15)))*$D$15,0)","v":0.49643926717557257},{"$f":"IF($B$15>0,($E$6-$E$7*($B$5/$B$15)-$E$8*$B$15*(($B$5/$B$15*$B$5/$B$15)))*$E$15,0)","v":0.48082671755725204},{"$f":"IF($B$15>0,($F$6-$F$7*($B$5/$B$15)-$F$8*$B$15*(($B$5/$B$15*$B$5/$B$15)))*$F$15,0)","v":0.51672366412213733},{"$f":"IF($B$15>0,($G$6-$G$7*($B$5/$B$15)-$G$8*$B$15*(($B$5/$B$15*$B$5/$B$15)))*$G$15,0)","v":0.48432366412213751},{"$f":"IF($B$15>0,($H$6-$H$7*($B$5/$B$15)-$H$8*$B$15*(($B$5/$B$15*$B$5/$B$15)))*$H$15,0)","v":0.61371297709923667},{"$f":"IF($B$15>0,($I$6-$I$7*($B$5/$B$15)-$I$8*$B$15*(($B$5/$B$15*$B$5/$B$15)))*$I$15,0)","v":0.71014271755725189}]
["Wirkungsgrad bei eingestellter Diff. bei 70° >",null,null,{"$f":"IF($B$16>0,($D$6-$D$7*($B$5/$B$16)-$D$8*$B$16*(($B$5/$B$16*$B$5/$B$16)))*$D$16,0)","v":0.31986819512195125},{"$f":"IF($B$16>0,($E$6-$E$7*($B$5/$B$16)-$E$8*$B$16*(($B$5/$B$16*$B$5/$B$16)))*$E$16,0)","v":0.30753170731707324},{"$f":"IF($B$16>0,($F$6-$F$7*($B$5/$B$16)-$F$8*$B$16*(($B$5/$B$16*$B$5/$B$16)))*$F$16,0)","v":0.34604780487804876},{"$f":"IF($B$16>0,($G$6-$G$7*($B$5/$B$16)-$G$8*$B$16*(($B$5/$B$16*$B$5/$B$16)))*$G$16,0)","v":0.30914341463414635},{"$f":"IF($B$16>0,($H$6-$H$7*($B$5/$B$16)-$H$8*$B$16*(($B$5/$B$16*$B$5/$B$16)))*$H$16,0)","v":0.6285014634146342},{"$f":"IF($B$16>0,($I$6-$I$7*($B$5/$B$16)-$I$8*$B$16*(($B$5/$B$16*$B$5/$B$16)))*$I$16,0)","v":0.50597590243902446}]
["Leistung nach Tagesverlauf  ",null,"Azimut",{"$f":"IF(D3>0,D3,\"\")","v":"SolRose 26"},{"$f":"IF(E3>0,E3,\"\")","v":"Synergie 210"},"Sunex AMX 2,85","Sunex 2,0","Star Azzurro CPC","Billig VRK"]
["Leistung bei eingetragener Fläche (KW)",null,-70,{"$f":"IF(D26>0,($B$16*D26*$B$6/1000)*$D$5/$D$4,0)","v":1.0425579236160001},{"$f":"IF(E26>0,($B$16*E26*$B$6/1000)*$E$5/$E$4,0)","v":0.97864754457971048},{"$f":"IF(F26>0,($B$16*F26*$B$6/1000)*$F$5/$F$4,0)","v":1.1045134061937281},{"$f":"IF(G26>0,($B$16*G26*$B$6/1000)*$G$5/$G$4,0)","v":0.96136279973201977},{"$f":"IF(H26>0,($B$16*H26*$B$6/1000)*$H$5/$H$4,0)","v":1.9087771581061224},{"$f":"IF(I26>0,($B$16*I26*$B$6/1000)*$I$5/$I$4,0)","v":1.1794442573718662}]
["Leistung bei eingetragener Fläche (KW)",null,-60,{"$f":"IF(D25>0,($B$15*D25*$B$6/1000)*$D$5/$D$4,0)","v":2.5849533069120008},{"$f":"IF(E25>0,($B$15*E25*$B$6/1000)*$E$5/$E$4,0)","v":2.4444572493913053},{"$f":"IF(F25>0,($B$15*F25*$B$6/1000)*$F$5/$F$4,0)","v":2.6348183979930315},{"$f":"IF(G25>0,($B$15*G25*$B$6/1000)*$G$5/$G$4,0)","v":2.4061375230738924},{"$f":"IF(H25>0,($B$15*H25*$B$6/1000)*$H$5/$H$4,0)","v":2.9776365445714288},{"$f":"IF(I25>0,($B$15*I25*$B$6/1000)*$I$5/$I$4,0)","v":2.6445432103869857}]
["Leistung bei eingetragener Fläche (KW)",null,-50,{"$f":"IF(D24>0,($B$14*D24*$B$6/1000)*$D$5/$D$4,0)","v":3.8316963090480005},{"$f":"IF(E24>0,($B$14*E24*$B$6/1000)*$E$5/$E$4,0)","v":3.5052637098666675},{"$f":"IF(F24>0,($B$14*F24*$B$6/1000)*$F$5/$F$4,0)","v":3.7495167419038324},{"$f":"IF(G24>0,($B$14*G24*$B$6/1000)*$G$5/$G$4,0)","v":3.4981498161182274},{"$f":"IF(H24>0,($B$14*H24*$B$6/1000)*$H$5/$H$4,0)","v":3.5515105775999998},{"$f":"IF(I24>0,($B$14*I24*$B$6/1000)*$I$5/$I$4,0)","v":3.5247159268991402}]
["Leistung bei eingetragener Fläche (KW)",null,-40,{"$f":"IF(D23>0,($B$13*D23*$B$6/1000)*$D$5/$D$4,0)","v":4.5854717368319999},{"$f":"IF(E23>0,($B$13*E23*$B$6/1000)*$E$5/$E$4,0)","v":4.2598558957449288},{"$f":"IF(F23>0,($B$13*F23*$B$6/1000)*$F$5/$F$4,0)","v":4.5425709692655065},{"$f":"IF(G23>0,($B$13*G23*$B$6/1000)*$G$5/$G$4,0)","v":4.2118753496906418},{"$f":"IF(H23>0,($B$13*H23*$B$6/1000)*$H$5/$H$4,0)","v":4.2223354645224509},{"$f":"IF(I23>0,($B$13*I23*$B$6/1000)*$I$5/$I$4,0)","v":3.8948848472803843}]
["Leistung bei eingetragener Fläche (KW)",null,-30,{"$f":"IF(D22>0,($B$12*D22*$B$6/1000)*$D$5/$D$4,0)","v":5.4459309556080031},{"$f":"IF(E22>0,($B$12*E22*$B$6/1000)*$E$5/$E$4,0)","v":4.9755113167768119},{"$f":"IF(F22>0,($B$12*F22*$B$6/1000)*$F$5/$F$4,0)","v":5.293192237814635},{"$f":"IF(G22>0,($B$12*G22*$B$6/1000)*$G$5/$G$4,0)","v":4.9242750622896576},{"$f":"IF(H22>0,($B$12*H22*$B$6/1000)*$H$5/$H$4,0)","v":4.7663340212571441},{"$f":"IF(I22>0,($B$12*I22*$B$6/1000)*$I$5/$I$4,0)","v":3.9265268537645936}]
["Leistung bei eingetragener Fläche (KW)",null,-20,{"$f":"IF(D21>0,($B$11*D21*$B$6/1000)*$D$5/$D$4,0)","v":6.0080254692000024},{"$f":"IF(E21>0,($B$11*E21*$B$6/1000)*$E$5/$E$4,0)","v":5.5012975454608695},{"$f":"IF(F21>0,($B$11*F21*$B$6/1000)*$F$5/$F$4,0)","v":5.8448849275066204},{"$f":"IF(G21>0,($B$11*G21*$B$6/1000)*$G$5/$G$4,0)","v":5.4475860056275893},{"$f":"IF(H21>0,($B$11*H21*$B$6/1000)*$H$5/$H$4,0)","v":5.0966709226285731},{"$f":"IF(I21>0,($B$11*I21*$B$6/1000)*$I$5/$I$4,0)","v":3.8554727267889}]
["Leistung bei eingetragener Fläche (KW)",null,-10,{"$f":"IF(D20>0,($B$10*D20*$B$6/1000)*$D$5/$D$4,0)","v":6.2816904492000019},{"$f":"IF(E20>0,($B$10*E20*$B$6/1000)*$E$5/$E$4,0)","v":5.8158133611594227},{"$f":"IF(F20>0,($B$10*F20*$B$6/1000)*$F$5/$F$4,0)","v":6.1752266834843219},{"$f":"IF(G20>0,($B$10*G20*$B$6/1000)*$G$5/$G$4,0)","v":5.7604949249261104},{"$f":"IF(H20>0,($B$10*H20*$B$6/1000)*$H$5/$H$4,0)","v":5.3001666790367352},{"$f":"IF(I20>0,($B$10*I20*$B$6/1000)*$I$5/$I$4,0)","v":3.8652119913492826}]
["Leistung bei eingetragener Fläche (KW)",null,0,{"$f":"IF(D19>0,($B$9*D19*$B$6/1000)*$D$5/$D$4,0)","v":6.3702291192000011},{"$f":"IF(E19>0,($B$9*E19*$B$6/1000)*$E$5/$E$4,0)","v":5.8995903814492765},{"$f":"IF(F19>0,($B$9*F19*$B$6/1000)*$F$5/$F$4,0)","v":6.2630010263414633},{"$f":"IF(G19>0,($B$9*G19*$B$6/1000)*$G$5/$G$4,0)","v":5.8439275948768481},{"$f":"IF(H19>0,($B$9*H19*$B$6/1000)*$H$5/$H$4,0)","v":5.3128747934693887},{"$f":"IF(I19>0,($B$9*I19*$B$6/1000)*$I$5/$I$4,0)","v":3.9163382692440201}]
["Leistung bei eingetragener Fläche (KW)",null,10,{"$f":"IF(D20>0,($B$10*D20*$B$6/1000)*$D$5/$D$4,0)","v":6.2816904492000019},{"$f":"IF(E20>0,($B$10*E20*$B$6/1000)*$E$5/$E$4,0)","v":5.8158133611594227},{"$f":"IF(F20>0,($B$10*F20*$B$6/1000)*$F$5/$F$4,0)","v":6.1752266834843219},{"$f":"IF(G20>0,($B$10*G20*$B$6/1000)*$G$5/$G$4,0)","v":5.7604949249261104},{"$f":"IF(H20>0,($B$10*H20*$B$6/1000)*$H$5/$H$4,0)","v":5.3001666790367352},{"$f":"IF(I20>0,($B$10*I20*$B$6/1000)*$I$5/$I$4,0)","v":3.8652119913492826}]
["Leistung bei eingetragener Fläche (KW)",null,20,{"$f":"IF(D21>0,($B$11*D21*$B$6/1000)*$D$5/$D$4,0)","v":6.0080254692000024},{"$f":"IF(E21>0,($B$11*E21*$B$6/1000)*$E$5/$E$4,0)","v":5.5012975454608695},{"$f":"IF(F21>0,($B$11*F21*$B$6/1000)*$F$5/$F$4,0)","v":5.8448849275066204},{"$f":"IF(G21>0,($B$11*G21*$B$6/1000)*$G$5/$G$4,0)","v":5.4475860056275893},{"$f":"IF(H21>0,($B$11*H21*$B$6/1000)*$H$5/$H$4,0)","v":5.0966709226285731},{"$f":"IF(I21>0,($B$11*I21*$B$6/1000)*$I$5/$I$4,0)","v":3.8554727267889}]
["Leistung bei eingetragener Fläche (KW)",null,30,{"$f":"IF(D22>0,($B$12*D22*$B$6/1000)*$D$5/$D$4,0)","v":5.4459309556080031},{"$f":"IF(E22>0,($B$12*E22*$B$6/1000)*$E$5/$E$4,0)","v":4.9755113167768119},{"$f":"IF(F22>0,($B$12*F22*$B$6/1000)*$F$5/$F$4,0)","v":5.293192237814635},{"$f":"IF(G22>0,($B$12*G22*$B$6/1000)*$G$5/$G$4,0)","v":4.9242750622896576},{"$f":"IF(H22>0,($B$12*H22*$B$6/1000)*$H$5/$H$4,0)","v":4.7663340212571441},{"$f":"IF(I22>0,($B$12*I22*$B$6/1000)*$I$5/$I$4,0)","v":3.9265268537645936}]
["Leistung bei eingetragener Fläche (KW)",null,40,{"$f":"IF(D23>0,($B$13*D23*$B$6/1000)*$D$5/$D$4,0)","v":4.5854717368319999},{"$f":"IF(E23>0,($B$13*E23*$B$6/1000)*$E$5/$E$4,0)","v":4.2598558957449288},{"$f":"IF(F23>0,($B$13*F23*$B$6/1000)*$F$5/$F$4,0)","v":4.5425709692655065},{"$f":"IF(G23>0,($B$13*G23*$B$6/1000)*$G$5/$G$4,0)","v":4.2118753496906418},{"$f":"IF(H23>0,($B$13*H23*$B$6/1000)*$H$5/$H$4,0)","v":4.2223354645224509},{"$f":"IF(I23>0,($B$13*I23*$B$6/1000)*$I$5/$I$4,0)","v":3.8948848472803843}]
["Leistung bei eingetragener Fläche (KW)",null,50,{"$f":"IF(D24>0,($B$14*D24*$B$6/1000)*$D$5/$D$4,0)","v":3.8316963090480005},{"$f":"IF(E24>0,($B$14*E24*$B$6/1000)*$E$5/$E$4,0)","v":3.5052637098666675},{"$f":"IF(F24>0,($B$14*F24*$B$6/1000)*$F$5/$F$4,0)","v":3.7495167419038324},{"$f":"IF(G24>0,($B$14*G24*$B$6/1000)*$G$5/$G$4,0)","v":3.4981498161182274},{"$f":"IF(H24>0,($B$14*H24*$B$6/1000)*$H$5/$H$4,0)","v":3.5515105775999998},{"$f":"IF(I24>0,($B$14*I24*$B$6/1000)*$I$5/$I$4,0)","v":3.5247159268991402}]
["Leistung bei eingetragener Fläche (KW)",null,60,{"$f":"IF(D25>0,($B$15*D25*$B$6/1000)*$D$5/$D$4,0)","v":2.5849533069120008},{"$f":"IF(E25>0,($B$15*E25*$B$6/1000)*$E$5/$E$4,0)","v":2.4444572493913053},{"$f":"IF(F25>0,($B$15*F25*$B$6/1000)*$F$5/$F$4,0)","v":2.6348183979930315},{"$f":"IF(G25>0,($B$15*G25*$B$6/1000)*$G$5/$G$4,0)","v":2.4061375230738924},{"$f":"IF(H25>0,($B$15*H25*$B$6/1000)*$H$5/$H$4,0)","v":2.9776365445714288},{"$f":"IF(I25>0,($B$15*I25*$B$6/1000)*$I$5/$I$4,0)","v":2.6445432103869857}]
["Leistung bei eingetragener Fläche (KW)",null,70,{"$f":"IF(D26>0,($B$16*D26*$B$6/1000)*$D$5/$D$4,0)","v":1.0425579236160001},{"$f":"IF(E26>0,($B$16*E26*$B$6/1000)*$E$5/$E$4,0)","v":0.97864754457971048},{"$f":"IF(F26>0,($B$16*F26*$B$6/1000)*$F$5/$F$4,0)","v":1.1045134061937281},{"$f":"IF(G26>0,($B$16*G26*$B$6/1000)*$G$5/$G$4,0)","v":0.96136279973201977},{"$f":"IF(H26>0,($B$16*H26*$B$6/1000)*$H$5/$H$4,0)","v":1.9087771581061224},{"$f":"IF(I26>0,($B$16*I26*$B$6/1000)*$I$5/$I$4,0)","v":1.1794442573718662}]
["KW Schnitt  > ",null,null,{"$f":"SUM(D28:D42)/15","v":4.395392094668801},{"$f":"SUM(E28:E42)/15","v":4.0574189084939141},4.3301631836443208,4.0175793705195426,4.0639825019276197,3.3131958597950888]
["KWH gesamt bei Azimut -70 bis +70 > ",null,null,{"$f":"IF(D43>0,D43*$B$17,0)","v":37.360832804684811},34.48806072219827,36.806387060976725,34.149424649416112,34.54385126638477,28.162164808258254]
["Puffervolumen (L) > ",{"$f":"Eingaben!B7","v":1500},"Erwärmung (K)>",{"$f":"IF(D44>0,D44/(($B$45/1000)*1*1.163),0)","v":21.41635586396378},{"$f":"IF(E44>0,E44/(($B$45/1000)*1*1.163),0)","v":19.769596286728731},21.098530846074365,19.575479879286966,19.801577108847678,16.143402011039413]
["Laufzeit gesamt (Std.) > ",{"$f":"B17","v":8.5},{"$f":"\"Berechnung nach Tagesverlauf bei leichter Bewölkung (mit IAM) mit Diff. \"&B5&\"  bei  \"&B6&\" m²\"&\"  am \"","v":"Berechnung nach Tagesverlauf bei leichter Bewölkung (mit IAM) mit Diff. 32  bei  10,46 m²  am "},null,null,null,null,{"$f":"H17","v":"2013-09-23"}]
["Wirkungsgrad bei  Diff.0  > ",null,null,{"$f":"$D$6-$D$7*(0/1000)-$D$8*1000*((0/1000*0/1000))","v":0.81},{"$f":"$E$6-$E$7*(0/1000)-$E$8*1000*((0/1000*0/1000))","v":0.78500000000000003},{"$f":"$F$6-$F$7*(0/1000)-$F$8*1000*((0/1000*0/1000))","v":0.82},{"$f":"$G$6-$G$7*(0/1000)-$G$8*1000*((0/1000*0/1000))","v":0.8},{"$f":"$H$6-$H$7*(0/1000)-$H$8*1000*((0/1000*0/1000))","v":0.64},{"$f":"$I$6-$I$7*(0/1000)-$I$8*1000*((0/1000*0/1000))","v":0.65400000000000003}]
["Wirkungsgrad bei eingestellter Diff. bei   0° >",null,null,{"$f":"IF(Eingaben!L57>0,($D$6-$D$7*($B$5/Eingaben!L57)-$D$8*Eingaben!L57*(($B$5/Eingaben!L57*$B$5/Eingaben!L57)))*$D$9,0)","v":0.63737664543524419},{"$f":"IF(Eingaben!L57>0,($E$6-$E$7*($B$5/Eingaben!L57)-$E$8*Eingaben!L57*(($B$5/Eingaben!L57*$B$5/Eingaben!L57)))*$E$9,0)","v":0.59902406227883931},{"$f":"IF(Eingaben!L57>0,($F$6-$F$7*($B$5/Eingaben!L57)-$F$8*Eingaben!L57*(($B$5/Eingaben!L57*$B$5/Eingaben!L57)))*$F$9,0)","v":0.63764755838641185},{"$f":"IF(Eingaben!L57>0,($G$6-$G$7*($B$5/Eingaben!L57)-$G$8*Eingaben!L57*(($B$5/Eingaben!L57*$B$5/Eingaben!L57)))*$G$9,0)","v":0.60578060863411187},{"$f":"IF(Eingaben!L57>0,($H$6-$H$7*($B$5/Eingaben!L57)-$H$8*Eingaben!L57*(($B$5/Eingaben!L57*$B$5/Eingaben!L57)))*$H$9,0)","v":0.59882802547770697},{"$f":"IF(Eingaben!L57>0,($I$6-$I$7*($B$5/Eingaben!L57)-$I$8*Eingaben!L57*(($B$5/Eingaben!L57*$B$5/Eingaben!L57)))*$I$9,0)","v":0.5619994338287333}]
["Wirkungsgrad bei eingestellter Diff. bei 10° >",null,null,{"$f":"IF(Eingaben!L58>0,($D$6-$D$7*($B$5/Eingaben!L58)-$D$8*Eingaben!L58*(($B$5/Eingaben!L58*$B$5/Eingaben!L58)))*$D$10,0)","v":0.63533705692803444},{"$f":"IF(Eingaben!L58>0,($E$6-$E$7*($B$5/Eingaben!L58)-$E$8*Eingaben!L58*(($B$5/Eingaben!L58*$B$5/Eingaben!L58)))*$E$10,0)","v":0.59682670963122098},{"$f":"IF(Eingaben!L58>0,($F$6-$F$7*($B$5/Eingaben!L58)-$F$8*Eingaben!L58*(($B$5/Eingaben!L58*$B$5/Eingaben!L58)))*$F$10,0)","v":0.63549301825993554},{"$f":"IF(Eingaben!L58>0,($G$6-$G$7*($B$5/Eingaben!L58)-$G$8*Eingaben!L58*(($B$5/Eingaben!L58*$B$5/Eingaben!L58)))*$G$10,0)","v":0.60348585750089523},{"$f":"IF(Eingaben!L58>0,($H$6-$H$7*($B$5/Eingaben!L58)-$H$8*Eingaben!L58*(($B$5/Eingaben!L58*$B$5/Eingaben!L58)))*$H$10,0)","v":0.60432498388829214},{"$f":"IF(Eingaben!L58>0,($I$6-$I$7*($B$5/Eingaben!L58)-$I$8*Eingaben!L58*(($B$5/Eingaben!L58*$B$5/Eingaben!L58)))*$I$10,0)","v":0.56091242391693519}]
["Wirkungsgrad bei eingestellter Diff. bei 20° >",null,null,{"$f":"IF(Eingaben!L59>0,($D$6-$D$7*($B$5/Eingaben!L59)-$D$8*Eingaben!L59*(($B$5/Eingaben!L59*$B$5/Eingaben!L59)))*$D$11,0)","v":0.62871661092530662},{"$f":"IF(Eingaben!L59>0,($E$6-$E$7*($B$5/Eingaben!L59)-$E$8*Eingaben!L59*(($B$5/Eingaben!L59*$B$5/Eingaben!L59)))*$E$11,0)","v":0.58379722408026757},{"$f":"IF(Eingaben!L59>0,($F$6-$F$7*($B$5/Eingaben!L59)-$F$8*Eingaben!L59*(($B$5/Eingaben!L59*$B$5/Eingaben!L59)))*$F$11,0)","v":0.62221444816053506},{"$f":"IF(Eingaben!L59>0,($G$6-$G$7*($B$5/Eingaben!L59)-$G$8*Eingaben!L59*(($B$5/Eingaben!L59*$B$5/Eingaben!L59)))*$G$11,0)","v":0.59007678929765894},{"$f":"IF(Eingaben!L59>0,($H$6-$H$7*($B$5/Eingaben!L59)-$H$8*Eingaben!L59*(($B$5/Eingaben!L59*$B$5/Eingaben!L59)))*$H$11,0)","v":0.60273016722408024},{"$f":"IF(Eingaben!L59>0,($I$6-$I$7*($B$5/Eingaben!L59)-$I$8*Eingaben!L59*(($B$5/Eingaben!L59*$B$5/Eingaben!L59)))*$I$11,0)","v":0.57967938164251209}]
["Wirkungsgrad bei eingestellter Diff. bei 30° >",null,null,{"$f":"IF(Eingaben!L60>0,($D$6-$D$7*($B$5/Eingaben!L60)-$D$8*Eingaben!L60*(($B$5/Eingaben!L60*$B$5/Eingaben!L60)))*$D$12,0)","v":0.60887231654676266},{"$f":"IF(Eingaben!L60>0,($E$6-$E$7*($B$5/Eingaben!L60)-$E$8*Eingaben!L60*(($B$5/Eingaben!L60*$B$5/Eingaben!L60)))*$E$12,0)","v":0.56344203037569951},{"$f":"IF(Eingaben!L60>0,($F$6-$F$7*($B$5/Eingaben!L60)-$F$8*Eingaben!L60*(($B$5/Eingaben!L60*$B$5/Eingaben!L60)))*$F$12,0)","v":0.60175290167865703},{"$f":"IF(Eingaben!L60>0,($G$6-$G$7*($B$5/Eingaben!L60)-$G$8*Eingaben!L60*(($B$5/Eingaben!L60*$B$5/Eingaben!L60)))*$G$12,0)","v":0.56901729816147084},{"$f":"IF(Eingaben!L60>0,($H$6-$H$7*($B$5/Eingaben!L60)-$H$8*Eingaben!L60*(($B$5/Eingaben!L60*$B$5/Eingaben!L60)))*$H$12,0)","v":0.60536633093525183},{"$f":"IF(Eingaben!L60>0,($I$6-$I$7*($B$5/Eingaben!L60)-$I$8*Eingaben!L60*(($B$5/Eingaben!L60*$B$5/Eingaben!L60)))*$I$12,0)","v":0.63259854516386893}]
["Wirkungsgrad bei eingestellter Diff. bei 40° >",null,null,{"$f":"IF(Eingaben!L61>0,($D$6-$D$7*($B$5/Eingaben!L61)-$D$8*Eingaben!L61*(($B$5/Eingaben!L61*$B$5/Eingaben!L61)))*$D$13,0)","v":0.56777909677419369},{"$f":"IF(Eingaben!L61>0,($E$6-$E$7*($B$5/Eingaben!L61)-$E$8*Eingaben!L61*(($B$5/Eingaben!L61*$B$5/Eingaben!L61)))*$E$13,0)","v":0.53304455197132627},{"$f":"IF(Eingaben!L61>0,($F$6-$F$7*($B$5/Eingaben!L61)-$F$8*Eingaben!L61*(($B$5/Eingaben!L61*$B$5/Eingaben!L61)))*$F$13,0)","v":0.57144473118279571},{"$f":"IF(Eingaben!L61>0,($G$6-$G$7*($B$5/Eingaben!L61)-$G$8*Eingaben!L61*(($B$5/Eingaben!L61*$B$5/Eingaben!L61)))*$G$13,0)","v":0.53747039426523302},{"$f":"IF(Eingaben!L61>0,($H$6-$H$7*($B$5/Eingaben!L61)-$H$8*Eingaben!L61*(($B$5/Eingaben!L61*$B$5/Eingaben!L61)))*$H$13,0)","v":0.59962838709677435},{"$f":"IF(Eingaben!L61>0,($I$6-$I$7*($B$5/Eingaben!L61)-$I$8*Eingaben!L61*(($B$5/Eingaben!L61*$B$5/Eingaben!L61)))*$I$13,0)","v":0.69877003584229391}]
["Wirkungsgrad bei eingestellter Diff. bei 50° >",null,null,{"$f":"IF(Eingaben!L62>0,($D$6-$D$7*($B$5/Eingaben!L62)-$D$8*Eingaben!L62*(($B$5/Eingaben!L62*$B$5/Eingaben!L62)))*$D$14,0)","v":0.52874470624048708},{"$f":"IF(Eingaben!L62>0,($E$6-$E$7*($B$5/Eingaben!L62)-$E$8*Eingaben!L62*(($B$5/Eingaben!L62*$B$5/Eingaben!L62)))*$E$14,0)","v":0.48724859462201925},{"$f":"IF(Eingaben!L62>0,($F$6-$F$7*($B$5/Eingaben!L62)-$F$8*Eingaben!L62*(($B$5/Eingaben!L62*$B$5/Eingaben!L62)))*$F$14,0)","v":0.52503220700152198},{"$f":"IF(Eingaben!L62>0,($G$6-$G$7*($B$5/Eingaben!L62)-$G$8*Eingaben!L62*(($B$5/Eingaben!L62*$B$5/Eingaben!L62)))*$G$14,0)","v":0.49545367833587012},{"$f":"IF(Eingaben!L62>0,($H$6-$H$7*($B$5/Eingaben!L62)-$H$8*Eingaben!L62*(($B$5/Eingaben!L62*$B$5/Eingaben!L62)))*$H$14,0)","v":0.56934867579908666},{"$f":"IF(Eingaben!L62>0,($I$6-$I$7*($B$5/Eingaben!L62)-$I$8*Eingaben!L62*(($B$5/Eingaben!L62*$B$5/Eingaben!L62)))*$I$14,0)","v":0.71004309690512446}]
["Wirkungsgrad bei eingestellter Diff. bei 60° >",null,null,{"$f":"IF(Eingaben!L63>0,($D$6-$D$7*($B$5/Eingaben!L63)-$D$8*Eingaben!L63*(($B$5/Eingaben!L63*$B$5/Eingaben!L63)))*$D$15,0)","v":0.42971902290076341},{"$f":"IF(Eingaben!L63>0,($E$6-$E$7*($B$5/Eingaben!L63)-$E$8*Eingaben!L63*(($B$5/Eingaben!L63*$B$5/Eingaben!L63)))*$E$15,0)","v":0.40560229007633591},{"$f":"IF(Eingaben!L63>0,($F$6-$F$7*($B$5/Eingaben!L63)-$F$8*Eingaben!L63*(($B$5/Eingaben!L63*$B$5/Eingaben!L63)))*$F$15,0)","v":0.44296488549618318},{"$f":"IF(Eingaben!L63>0,($G$6-$G$7*($B$5/Eingaben!L63)-$G$8*Eingaben!L63*(($B$5/Eingaben!L63*$B$5/Eingaben!L63)))*$G$15,0)","v":0.40576488549618323},{"$f":"IF(Eingaben!L63>0,($H$6-$H$7*($B$5/Eingaben!L63)-$H$8*Eingaben!L63*(($B$5/Eingaben!L63*$B$5/Eingaben!L63)))*$H$15,0)","v":0.59428396946564888},{"$f":"IF(Eingaben!L63>0,($I$6-$I$7*($B$5/Eingaben!L63)-$I$8*Eingaben!L63*(($B$5/Eingaben!L63*$B$5/Eingaben!L63)))*$I$15,0)","v":0.65473695674300258}]
["Wirkungsgrad bei eingestellter Diff. bei 70° >",null,null,{"$f":"IF(Eingaben!L64>0,($D$6-$D$7*($B$5/Eingaben!L64)-$D$8*Eingaben!L64*(($B$5/Eingaben!L64*$B$5/Eingaben!L64)))*$D$16,0)","v":0.22939092682926829},{"$f":"IF(Eingaben!L64>0,($E$6-$E$7*($B$5/Eingaben!L64)-$E$8*Eingaben!L64*(($B$5/Eingaben!L64*$B$5/Eingaben!L64)))*$E$16,0)","v":0.20070894308943088},{"$f":"IF(Eingaben!L64>0,($F$6-$F$7*($B$5/Eingaben!L64)-$F$8*Eingaben!L64*(($B$5/Eingaben!L64*$B$5/Eingaben!L64)))*$F$16,0)","v":0.23999707317073163},{"$f":"IF(Eingaben!L64>0,($G$6-$G$7*($B$5/Eingaben!L64)-$G$8*Eingaben!L64*(($B$5/Eingaben!L64*$B$5/Eingaben!L64)))*$G$16,0)","v":0.19619121951219506},{"$f":"IF(Eingaben!L64>0,($H$6-$H$7*($B$5/Eingaben!L64)-$H$8*Eingaben!L64*(($B$5/Eingaben!L64*$B$5/Eingaben!L64)))*$H$16,0)","v":0.59480195121951207},{"$f":"IF(Eingaben!L64>0,($I$6-$I$7*($B$5/Eingaben!L64)-$I$8*Eingaben!L64*(($B$5/Eingaben!L64*$B$5/Eingaben!L64)))*$I$16,0)","v":0.4326545365853659}]
["Leistung nach Tagesverlauf  ",null,"Azimut",{"$f":"D27","v":"SolRose 26"},{"$f":"E27","v":"Synergie 210"},"Sunex AMX 2,85","Sunex 2,0","Star Azzurro CPC","Billig VRK"]
["Leistung bei eingetragener Fläche (KW)",null,-70,{"$f":"IF(D55>0,(Eingaben!L64*D55*$B$6/1000)*$D$5/$D$4,0)","v":0.56074657941600003},{"$f":"IF(E55>0,(Eingaben!L64*E55*$B$6/1000)*$E$5/$E$4,0)","v":0.47903185994202901},{"$f":"IF(F55>0,(Eingaben!L64*F55*$B$6/1000)*$F$5/$F$4,0)","v":0.57451596505087077},{"$f":"IF(G55>0,(Eingaben!L64*G55*$B$6/1000)*$G$5/$G$4,0)","v":0.4575811689931033},{"$f":"IF(H55>0,(Eingaben!L64*H55*$B$6/1000)*$H$5/$H$4,0)","v":1.354823072228571},{"$f":"IF(I55>0,(Eingaben!L64*I55*$B$6/1000)*$I$5/$I$4,0)","v":0.75639754701014361}]
["Leistung bei eingetragener Fläche (KW)",null,-60,{"$f":"IF(D54>0,(Eingaben!L63*D54*$B$6/1000)*$D$5/$D$4,0)","v":1.6781563467120004},{"$f":"IF(E54>0,(Eingaben!L63*E54*$B$6/1000)*$E$5/$E$4,0)","v":1.5465199137391308},{"$f":"IF(F54>0,(Eingaben!L63*F54*$B$6/1000)*$F$5/$F$4,0)","v":1.6940370322787455},{"$f":"IF(G54>0,(Eingaben!L63*G54*$B$6/1000)*$G$5/$G$4,0)","v":1.5118909969655174},{"$f":"IF(H54>0,(Eingaben!L63*H54*$B$6/1000)*$H$5/$H$4,0)","v":2.1625275960000003},{"$f":"IF(I54>0,(Eingaben!L63*I54*$B$6/1000)*$I$5/$I$4,0)","v":1.8286607720558854}]
["Leistung bei eingetragener Fläche (KW)",null,-50,{"$f":"IF(D53>0,(Eingaben!L62*D53*$B$6/1000)*$D$5/$D$4,0)","v":2.5889755858980004},{"$f":"IF(E53>0,(Eingaben!L62*E53*$B$6/1000)*$E$5/$E$4,0)","v":2.3293770691710143},{"$f":"IF(F53>0,(Eingaben!L62*F53*$B$6/1000)*$F$5/$F$4,0)","v":2.5175240450466898},{"$f":"IF(G53>0,(Eingaben!L62*G53*$B$6/1000)*$G$5/$G$4,0)","v":2.3146384308965526},{"$f":"IF(H53>0,(Eingaben!L62*H53*$B$6/1000)*$H$5/$H$4,0)","v":2.5976464416000002},{"$f":"IF(I53>0,(Eingaben!L62*I53*$B$6/1000)*$I$5/$I$4,0)","v":2.4864806581603838}]
["Leistung bei eingetragener Fläche (KW)",null,-40,{"$f":"IF(D52>0,(Eingaben!L61*D52*$B$6/1000)*$D$5/$D$4,0)","v":3.1482476536320014},{"$f":"IF(E52>0,(Eingaben!L61*E52*$B$6/1000)*$E$5/$E$4,0)","v":2.8857604411362332},{"$f":"IF(F52>0,(Eingaben!L61*F52*$B$6/1000)*$F$5/$F$4,0)","v":3.1029121566940767},{"$f":"IF(G52>0,(Eingaben!L61*G52*$B$6/1000)*$G$5/$G$4,0)","v":2.8434278667349764},{"$f":"IF(H52>0,(Eingaben!L61*H52*$B$6/1000)*$H$5/$H$4,0)","v":3.0980717806040827},{"$f":"IF(I52>0,(Eingaben!L61*I52*$B$6/1000)*$I$5/$I$4,0)","v":2.7710363022851676}]
["Leistung bei eingetragener Fläche (KW)",null,-30,{"$f":"IF(D51>0,(Eingaben!L60*D51*$B$6/1000)*$D$5/$D$4,0)","v":3.7845028130580007},{"$f":"IF(E51>0,(Eingaben!L60*E51*$B$6/1000)*$E$5/$E$4,0)","v":3.4193150844289857},{"$f":"IF(F51>0,(Eingaben!L60*F51*$B$6/1000)*$F$5/$F$4,0)","v":3.6627439218146338},{"$f":"IF(G51>0,(Eingaben!L60*G51*$B$6/1000)*$G$5/$G$4,0)","v":3.3744752940137936},{"$f":"IF(H51>0,(Eingaben!L60*H51*$B$6/1000)*$H$5/$H$4,0)","v":3.5060706981551033},{"$f":"IF(I51>0,(Eingaben!L60*I51*$B$6/1000)*$I$5/$I$4,0)","v":2.812090191745455}]
["Leistung bei eingetragener Fläche (KW)",null,-20,{"$f":"IF(D50>0,(Eingaben!L59*D50*$B$6/1000)*$D$5/$D$4,0)","v":4.2030439467000011},{"$f":"IF(E50>0,(Eingaben!L59*E50*$B$6/1000)*$E$5/$E$4,0)","v":3.8104678334608701},{"$f":"IF(F50>0,(Eingaben!L59*F50*$B$6/1000)*$F$5/$F$4,0)","v":4.0733792527923347},{"$f":"IF(G50>0,(Eingaben!L59*G50*$B$6/1000)*$G$5/$G$4,0)","v":3.763706144346799},{"$f":"IF(H50>0,(Eingaben!L59*H50*$B$6/1000)*$H$5/$H$4,0)","v":3.7544967057306122},{"$f":"IF(I50>0,(Eingaben!L59*I50*$B$6/1000)*$I$5/$I$4,0)","v":2.7715026785515788}]
["Leistung bei eingetragener Fläche (KW)",null,-10,{"$f":"IF(D49>0,(Eingaben!L58*D49*$B$6/1000)*$D$5/$D$4,0)","v":4.4082926817000008},{"$f":"IF(E49>0,(Eingaben!L58*E49*$B$6/1000)*$E$5/$E$4,0)","v":4.0431677727536242},{"$f":"IF(F49>0,(Eingaben!L58*F49*$B$6/1000)*$F$5/$F$4,0)","v":4.3180013834843205},{"$f":"IF(G49>0,(Eingaben!L58*G49*$B$6/1000)*$G$5/$G$4,0)","v":3.9951354766502485},{"$f":"IF(H49>0,(Eingaben!L58*H49*$B$6/1000)*$H$5/$H$4,0)","v":3.9071185230367349},{"$f":"IF(I49>0,(Eingaben!L58*I49*$B$6/1000)*$I$5/$I$4,0)","v":2.7834264295311009}]
["Leistung bei eingetragener Fläche (KW)",null,0,{"$f":"IF(D48>0,(Eingaben!L57*D48*$B$6/1000)*$D$5/$D$4,0)","v":4.4746966842000013},{"$f":"IF(E48>0,(Eingaben!L57*E48*$B$6/1000)*$E$5/$E$4,0)","v":4.1060005379710143},{"$f":"IF(F48>0,(Eingaben!L57*F48*$B$6/1000)*$F$5/$F$4,0)","v":4.3838321406271783},{"$f":"IF(G48>0,(Eingaben!L57*G48*$B$6/1000)*$G$5/$G$4,0)","v":4.0577099791133016},{"$f":"IF(H48>0,(Eingaben!L57*H48*$B$6/1000)*$H$5/$H$4,0)","v":3.9173229404081638},{"$f":"IF(I48>0,(Eingaben!L57*I48*$B$6/1000)*$I$5/$I$4,0)","v":2.8217711379521542}]
["Leistung bei eingetragener Fläche (KW)",null,10,{"$f":"IF(D49>0,(Eingaben!L58*D49*$B$6/1000)*$D$5/$D$4,0)","v":4.4082926817000008},{"$f":"IF(E49>0,(Eingaben!L58*E49*$B$6/1000)*$E$5/$E$4,0)","v":4.0431677727536242},{"$f":"IF(F49>0,(Eingaben!L58*F49*$B$6/1000)*$F$5/$F$4,0)","v":4.3180013834843205},{"$f":"IF(G49>0,(Eingaben!L58*G49*$B$6/1000)*$G$5/$G$4,0)","v":3.9951354766502485},{"$f":"IF(H49>0,(Eingaben!L58*H49*$B$6/1000)*$H$5/$H$4,0)","v":3.9071185230367349},{"$f":"IF(I49>0,(Eingaben!L58*I49*$B$6/1000)*$I$5/$I$4,0)","v":2.7834264295311009}]
["Leistung bei eingetragener Fläche (KW)",null,20,{"$f":"IF(D50>0,(Eingaben!L59*D50*$B$6/1000)*$D$5/$D$4,0)","v":4.2030439467000011},{"$f":"IF(E50>0,(Eingaben!L59*E50*$B$6/1000)*$E$5/$E$4,0)","v":3.8104678334608701},{"$f":"IF(F50>0,(Eingaben!L59*F50*$B$6/1000)*$F$5/$F$4,0)","v":4.0733792527923347},{"$f":"IF(G50>0,(Eingaben!L59*G50*$B$6/1000)*$G$5/$G$4,0)","v":3.763706144346799},{"$f":"IF(H50>0,(Eingaben!L59*H50*$B$6/1000)*$H$5/$H$4,0)","v":3.7544967057306122},{"$f":"IF(I50>0,(Eingaben!L59*I50*$B$6/1000)*$I$5/$I$4,0)","v":2.7715026785515788}]
["Leistung bei eingetragener Fläche (KW)",null,30,{"$f":"IF(D51>0,(Eingaben!L60*D51*$B$6/1000)*$D$5/$D$4,0)","v":3.7845028130580007},{"$f":"IF(E51>0,(Eingaben!L60*E51*$B$6/1000)*$E$5/$E$4,0)","v":3.4193150844289857},{"$f":"IF(F51>0,(Eingaben!L60*F51*$B$6/1000)*$F$5/$F$4,0)","v":3.6627439218146338},{"$f":"IF(G51>0,(Eingaben!L60*G51*$B$6/1000)*$G$5/$G$4,0)","v":3.3744752940137936},{"$f":"IF(H51>0,(Eingaben!L60*H51*$B$6/1000)*$H$5/$H$4,0)","v":3.5060706981551033},{"$f":"IF(I51>0,(Eingaben!L60*I51*$B$6/1000)*$I$5/$I$4,0)","v":2.812090191745455}]
["Leistung bei eingetragener Fläche (KW)",null,40,{"$f":"IF(D52>0,(Eingaben!L61*D52*$B$6/1000)*$D$5/$D$4,0)","v":3.1482476536320014},{"$f":"IF(E52>0,(Eingaben!L61*E52*$B$6/1000)*$E$5/$E$4,0)","v":2.8857604411362332},{"$f":"IF(F52>0,(Eingaben!L61*F52*$B$6/1000)*$F$5/$F$4,0)","v":3.1029121566940767},{"$f":"IF(G52>0,(Eingaben!L61*G52*$B$6/1000)*$G$5/$G$4,0)","v":2.8434278667349764},{"$f":"IF(H52>0,(Eingaben!L61*H52*$B$6/1000)*$H$5/$H$4,0)","v":3.0980717806040827},{"$f":"IF(I52>0,(Eingaben!L61*I52*$B$6/1000)*$I$5/$I$4,0)","v":2.7710363022851676}]
["Leistung bei eingetragener Fläche (KW)",null,50,{"$f":"IF(D53>0,(Eingaben!L62*D53*$B$6/1000)*$D$5/$D$4,0)","v":2.5889755858980004},{"$f":"IF(E53>0,(Eingaben!L62*E53*$B$6/1000)*$E$5/$E$4,0)","v":2.3293770691710143},{"$f":"IF(F53>0,(Eingaben!L62*F53*$B$6/1000)*$F$5/$F$4,0)","v":2.5175240450466898},{"$f":"IF(G53>0,(Eingaben!L62*G53*$B$6/1000)*$G$5/$G$4,0)","v":2.3146384308965526},{"$f":"IF(H53>0,(Eingaben!L62*H53*$B$6/1000)*$H$5/$H$4,0)","v":2.5976464416000002},{"$f":"IF(I53>0,(Eingaben!L62*I53*$B$6/1000)*$I$5/$I$4,0)","v":2.4864806581603838}]
["Leistung bei eingetragener Fläche (KW)",null,60,{"$f":"IF(D54>0,(Eingaben!L63*D54*$B$6/1000)*$D$5/$D$4,0)","v":1.6781563467120004},{"$f":"IF(E54>0,(Eingaben!L63*E54*$B$6/1000)*$E$5/$E$4,0)","v":1.5465199137391308},{"$f":"IF(F54>0,(Eingaben!L63*F54*$B$6/1000)*$F$5/$F$4,0)","v":1.6940370322787455},{"$f":"IF(G54>0,(Eingaben!L63*G54*$B$6/1000)*$G$5/$G$4,0)","v":1.5118909969655174},{"$f":"IF(H54>0,(Eingaben!L63*H54*$B$6/1000)*$H$5/$H$4,0)","v":2.1625275960000003},{"$f":"IF(I54>0,(Eingaben!L63*I54*$B$6/1000)*$I$5/$I$4,0)","v":1.8286607720558854}]
["Leistung bei eingetragener Fläche (KW)",null,70,{"$f":"IF(D55>0,(Eingaben!L64*D55*$B$6/1000)*$D$5/$D$4,0)","v":0.56074657941600003},{"$f":"IF(E55>0,(Eingaben!L64*E55*$B$6/1000)*$E$5/$E$4,0)","v":0.47903185994202901},{"$f":"IF(F55>0,(Eingaben!L64*F55*$B$6/1000)*$F$5/$F$4,0)","v":0.57451596505087077},{"$f":"IF(G55>0,(Eingaben!L64*G55*$B$6/1000)*$G$5/$G$4,0)","v":0.4575811689931033},{"$f":"IF(H55>0,(Eingaben!L64*H55*$B$6/1000)*$H$5/$H$4,0)","v":1.354823072228571},{"$f":"IF(I55>0,(Eingaben!L64*I55*$B$6/1000)*$I$5/$I$4,0)","v":0.75639754701014361}]
["KW Schnitt  > ",null,null,{"$f":"SUM(D57:D71)/15","v":3.0145751932287999},{"$f":"SUM(E57:E71)/15","v":2.7422186991489856},2.9513373103300342,2.7052947157543517,2.9785888383412251,2.3493973531087722]
["KWH gesamt bei Azimut -70 bis +70 > ",null,null,{"$f":"IF(D72>0,D72*$B$17,0)","v":25.623889142444799},23.308858942766378,25.08636713780529,22.995005083911987,25.318005125900413,19.969877501424563]
["Puffervolumen (L) > ",{"$f":"B45","v":1500},"Erwärmung (K)>",{"$f":"IF(D73>0,D73/(($B$45/1000)*1*1.163),0)","v":14.688385865545888},{"$f":"IF(E73>0,E73/(($B$45/1000)*1*1.163),0)","v":13.36134075251727},14.380262045173568,13.181430257329888,14.513043924276534,11.44733591368562]
["Laufzeit gesamt (Std.) > ",{"$f":"B17","v":8.5},{"$f":"\"Berechnung nach Tagesverlauf bei mittlerer Bewölkung (mit IAM) mit Diff. \"&B5&\"  bei  \"&B6&\" m²\"&\"  am \"","v":"Berechnung nach Tagesverlauf bei mittlerer Bewölkung (mit IAM) mit Diff. 32  bei  10,46 m²  am "},null,null,null,null,{"$f":"H17","v":"2013-09-23"}]
["Wirkungsgrad bei  Diff.0  > ",null,null,{"$f":"$D$6-$D$7*(0/1000)-$D$8*1000*((0/1000*0/1000))","v":0.81},{"$f":"$E$6-$E$7*(0/1000)-$E$8*1000*((0/1000*0/1000))","v":0.78500000000000003},{"$f":"$F$6-$F$7*(0/1000)-$F$8*1000*((0/1000*0/1000))","v":0.82},{"$f":"$G$6-$G$7*(0/1000)-$G$8*1000*((0/1000*0/1000))","v":0.8},{"$f":"$H$6-$H$7*(0/1000)-$H$8*1000*((0/1000*0/1000))","v":0.64},{"$f":"$I$6-$I$7*(0/1000)-$I$8*1000*((0/1000*0/1000))","v":0.65400000000000003}]
["Wirkungsgrad bei eingestellter Diff. bei   0° >",null,null,{"$f":"IF(Eingaben!L93>0,($D$6-$D$7*($B$5/Eingaben!L93)-$D$8*Eingaben!L93*(($B$5/Eingaben!L93*$B$5/Eingaben!L93)))*$D$9,0)","v":0.55106496815286632},{"$f":"IF(Eingaben!L93>0,($E$6-$E$7*($B$5/Eingaben!L93)-$E$8*Eingaben!L93*(($B$5/Eingaben!L93*$B$5/Eingaben!L93)))*$E$9,0)","v":0.50603609341825906},{"$f":"IF(Eingaben!L93>0,($F$6-$F$7*($B$5/Eingaben!L93)-$F$8*Eingaben!L93*(($B$5/Eingaben!L93*$B$5/Eingaben!L93)))*$F$9,0)","v":0.54647133757961774},{"$f":"IF(Eingaben!L93>0,($G$6-$G$7*($B$5/Eingaben!L93)-$G$8*Eingaben!L93*(($B$5/Eingaben!L93*$B$5/Eingaben!L93)))*$G$9,0)","v":0.50867091295116773},{"$f":"IF(Eingaben!L93>0,($H$6-$H$7*($B$5/Eingaben!L93)-$H$8*Eingaben!L93*(($B$5/Eingaben!L93*$B$5/Eingaben!L93)))*$H$9,0)","v":0.57824203821656051},{"$f":"IF(Eingaben!L93>0,($I$6-$I$7*($B$5/Eingaben!L93)-$I$8*Eingaben!L93*(($B$5/Eingaben!L93*$B$5/Eingaben!L93)))*$I$9,0)","v":0.51599915074309977}]
["Wirkungsgrad bei eingestellter Diff. bei 10° >",null,null,{"$f":"IF(Eingaben!L94>0,($D$6-$D$7*($B$5/Eingaben!L94)-$D$8*Eingaben!L94*(($B$5/Eingaben!L94*$B$5/Eingaben!L94)))*$D$10,0)","v":0.54800558539205169},{"$f":"IF(Eingaben!L94>0,($E$6-$E$7*($B$5/Eingaben!L94)-$E$8*Eingaben!L94*(($B$5/Eingaben!L94*$B$5/Eingaben!L94)))*$E$10,0)","v":0.50274006444683139},{"$f":"IF(Eingaben!L94>0,($F$6-$F$7*($B$5/Eingaben!L94)-$F$8*Eingaben!L94*(($B$5/Eingaben!L94*$B$5/Eingaben!L94)))*$F$10,0)","v":0.54323952738990333},{"$f":"IF(Eingaben!L94>0,($G$6-$G$7*($B$5/Eingaben!L94)-$G$8*Eingaben!L94*(($B$5/Eingaben!L94*$B$5/Eingaben!L94)))*$G$10,0)","v":0.50522878625134271},{"$f":"IF(Eingaben!L94>0,($H$6-$H$7*($B$5/Eingaben!L94)-$H$8*Eingaben!L94*(($B$5/Eingaben!L94*$B$5/Eingaben!L94)))*$H$10,0)","v":0.58328747583243834},{"$f":"IF(Eingaben!L94>0,($I$6-$I$7*($B$5/Eingaben!L94)-$I$8*Eingaben!L94*(($B$5/Eingaben!L94*$B$5/Eingaben!L94)))*$I$10,0)","v":0.51436863587540271}]
["Wirkungsgrad bei eingestellter Diff. bei 20° >",null,null,{"$f":"IF(Eingaben!L95>0,($D$6-$D$7*($B$5/Eingaben!L95)-$D$8*Eingaben!L95*(($B$5/Eingaben!L95*$B$5/Eingaben!L95)))*$D$11,0)","v":0.53807491638796001},{"$f":"IF(Eingaben!L95>0,($E$6-$E$7*($B$5/Eingaben!L95)-$E$8*Eingaben!L95*(($B$5/Eingaben!L95*$B$5/Eingaben!L95)))*$E$11,0)","v":0.48712083612040147},{"$f":"IF(Eingaben!L95>0,($F$6-$F$7*($B$5/Eingaben!L95)-$F$8*Eingaben!L95*(($B$5/Eingaben!L95*$B$5/Eingaben!L95)))*$F$11,0)","v":0.52742167224080272},{"$f":"IF(Eingaben!L95>0,($G$6-$G$7*($B$5/Eingaben!L95)-$G$8*Eingaben!L95*(($B$5/Eingaben!L95*$B$5/Eingaben!L95)))*$G$11,0)","v":0.4891151839464884},{"$f":"IF(Eingaben!L95>0,($H$6-$H$7*($B$5/Eingaben!L95)-$H$8*Eingaben!L95*(($B$5/Eingaben!L95*$B$5/Eingaben!L95)))*$H$11,0)","v":0.58089525083612037},{"$f":"IF(Eingaben!L95>0,($I$6-$I$7*($B$5/Eingaben!L95)-$I$8*Eingaben!L95*(($B$5/Eingaben!L95*$B$5/Eingaben!L95)))*$I$11,0)","v":0.5294390724637682}]
["Wirkungsgrad bei eingestellter Diff. bei 30° >",null,null,{"$f":"IF(Eingaben!L96>0,($D$6-$D$7*($B$5/Eingaben!L96)-$D$8*Eingaben!L96*(($B$5/Eingaben!L96*$B$5/Eingaben!L96)))*$D$12,0)","v":0.51235847482014396},{"$f":"IF(Eingaben!L96>0,($E$6-$E$7*($B$5/Eingaben!L96)-$E$8*Eingaben!L96*(($B$5/Eingaben!L96*$B$5/Eingaben!L96)))*$E$12,0)","v":0.46051304556354916},{"$f":"IF(Eingaben!L96>0,($F$6-$F$7*($B$5/Eingaben!L96)-$F$8*Eingaben!L96*(($B$5/Eingaben!L96*$B$5/Eingaben!L96)))*$F$12,0)","v":0.50082935251798566},{"$f":"IF(Eingaben!L96>0,($G$6-$G$7*($B$5/Eingaben!L96)-$G$8*Eingaben!L96*(($B$5/Eingaben!L96*$B$5/Eingaben!L96)))*$G$12,0)","v":0.4615259472422063},{"$f":"IF(Eingaben!L96>0,($H$6-$H$7*($B$5/Eingaben!L96)-$H$8*Eingaben!L96*(($B$5/Eingaben!L96*$B$5/Eingaben!L96)))*$H$12,0)","v":0.58164949640287777},{"$f":"IF(Eingaben!L96>0,($I$6-$I$7*($B$5/Eingaben!L96)-$I$8*Eingaben!L96*(($B$5/Eingaben!L96*$B$5/Eingaben!L96)))*$I$12,0)","v":0.57284781774580329}]
["Wirkungsgrad bei eingestellter Diff. bei 40° >",null,null,{"$f":"IF(Eingaben!L104>0,($D$6-$D$7*($B$5/Eingaben!L104)-$D$8*Eingaben!L104*(($B$5/Eingaben!L104*$B$5/Eingaben!L104)))*$D$13,0)","v":0.46286864516129034},{"$f":"IF(Eingaben!L104>0,($E$6-$E$7*($B$5/Eingaben!L104)-$E$8*Eingaben!L104*(($B$5/Eingaben!L104*$B$5/Eingaben!L104)))*$E$13,0)","v":0.41884182795698927},{"$f":"IF(Eingaben!L104>0,($F$6-$F$7*($B$5/Eingaben!L104)-$F$8*Eingaben!L104*(($B$5/Eingaben!L104*$B$5/Eingaben!L104)))*$F$13,0)","v":0.4594670967741934},{"$f":"IF(Eingaben!L104>0,($G$6-$G$7*($B$5/Eingaben!L104)-$G$8*Eingaben!L104*(($B$5/Eingaben!L104*$B$5/Eingaben!L104)))*$G$13,0)","v":0.41820559139784946},{"$f":"IF(Eingaben!L104>0,($H$6-$H$7*($B$5/Eingaben!L104)-$H$8*Eingaben!L104*(($B$5/Eingaben!L104*$B$5/Eingaben!L104)))*$H$13,0)","v":0.57304258064516134},{"$f":"IF(Eingaben!L104>0,($I$6-$I$7*($B$5/Eingaben!L104)-$I$8*Eingaben!L104*(($B$5/Eingaben!L104*$B$5/Eingaben!L104)))*$I$13,0)","v":0.62305505376344084}]
["Wirkungsgrad bei eingestellter Diff. bei 50° >",null,null,{"$f":"IF(Eingaben!L105>0,($D$6-$D$7*($B$5/Eingaben!L105)-$D$8*Eingaben!L105*(($B$5/Eingaben!L105*$B$5/Eingaben!L105)))*$D$14,0)","v":0.41241705936073064},{"$f":"IF(Eingaben!L105>0,($E$6-$E$7*($B$5/Eingaben!L105)-$E$8*Eingaben!L105*(($B$5/Eingaben!L105*$B$5/Eingaben!L105)))*$E$14,0)","v":0.36192289193302896},{"$f":"IF(Eingaben!L105>0,($F$6-$F$7*($B$5/Eingaben!L105)-$F$8*Eingaben!L105*(($B$5/Eingaben!L105*$B$5/Eingaben!L105)))*$F$14,0)","v":0.40214831050228306},{"$f":"IF(Eingaben!L105>0,($G$6-$G$7*($B$5/Eingaben!L105)-$G$8*Eingaben!L105*(($B$5/Eingaben!L105*$B$5/Eingaben!L105)))*$G$14,0)","v":0.3631805175038052},{"$f":"IF(Eingaben!L105>0,($H$6-$H$7*($B$5/Eingaben!L105)-$H$8*Eingaben!L105*(($B$5/Eingaben!L105*$B$5/Eingaben!L105)))*$H$14,0)","v":0.54042301369863022},{"$f":"IF(Eingaben!L105>0,($I$6-$I$7*($B$5/Eingaben!L105)-$I$8*Eingaben!L105*(($B$5/Eingaben!L105*$B$5/Eingaben!L105)))*$I$14,0)","v":0.62034464535768652}]
["Wirkungsgrad bei eingestellter Diff. bei 60° >",null,null,{"$f":"IF(Eingaben!L106>0,($D$6-$D$7*($B$5/Eingaben!L106)-$D$8*Eingaben!L106*(($B$5/Eingaben!L106*$B$5/Eingaben!L106)))*$D$15,0)","v":0.2962785343511451},{"$f":"IF(Eingaben!L106>0,($E$6-$E$7*($B$5/Eingaben!L106)-$E$8*Eingaben!L106*(($B$5/Eingaben!L106*$B$5/Eingaben!L106)))*$E$15,0)","v":0.25515343511450389},{"$f":"IF(Eingaben!L106>0,($F$6-$F$7*($B$5/Eingaben!L106)-$F$8*Eingaben!L106*(($B$5/Eingaben!L106*$B$5/Eingaben!L106)))*$F$15,0)","v":0.29544732824427478},{"$f":"IF(Eingaben!L106>0,($G$6-$G$7*($B$5/Eingaben!L106)-$G$8*Eingaben!L106*(($B$5/Eingaben!L106*$B$5/Eingaben!L106)))*$G$15,0)","v":0.2486473282442748},{"$f":"IF(Eingaben!L106>0,($H$6-$H$7*($B$5/Eingaben!L106)-$H$8*Eingaben!L106*(($B$5/Eingaben!L106*$B$5/Eingaben!L106)))*$H$15,0)","v":0.5554259541984734},{"$f":"IF(Eingaben!L106>0,($I$6-$I$7*($B$5/Eingaben!L106)-$I$8*Eingaben!L106*(($B$5/Eingaben!L106*$B$5/Eingaben!L106)))*$I$15,0)","v":0.54392543511450397}]
["Wirkungsgrad bei eingestellter Diff. bei 70° >",null,null,{"$f":"IF(Eingaben!L107>0,($D$6-$D$7*($B$5/Eingaben!L107)-$D$8*Eingaben!L107*(($B$5/Eingaben!L107*$B$5/Eingaben!L107)))*$D$16,0)","v":4.8436390243902457E-2},{"$f":"IF(Eingaben!L107>0,($E$6-$E$7*($B$5/Eingaben!L107)-$E$8*Eingaben!L107*(($B$5/Eingaben!L107*$B$5/Eingaben!L107)))*$E$16,0)","v":-1.2936585365853615E-2},{"$f":"IF(Eingaben!L107>0,($F$6-$F$7*($B$5/Eingaben!L107)-$F$8*Eingaben!L107*(($B$5/Eingaben!L107*$B$5/Eingaben!L107)))*$F$16,0)","v":2.789560975609752E-2},{"$f":"IF(Eingaben!L107>0,($G$6-$G$7*($B$5/Eingaben!L107)-$G$8*Eingaben!L107*(($B$5/Eingaben!L107*$B$5/Eingaben!L107)))*$G$16,0)","v":-2.9713170731707327E-2},{"$f":"IF(Eingaben!L107>0,($H$6-$H$7*($B$5/Eingaben!L107)-$H$8*Eingaben!L107*(($B$5/Eingaben!L107*$B$5/Eingaben!L107)))*$H$16,0)","v":0.52740292682926826},{"$f":"IF(Eingaben!L107>0,($I$6-$I$7*($B$5/Eingaben!L107)-$I$8*Eingaben!L107*(($B$5/Eingaben!L107*$B$5/Eingaben!L107)))*$I$16,0)","v":0.28601180487804878}]
["Leistung nach Tagesverlauf  ",null,"Azimut",{"$f":"D27","v":"SolRose 26"},{"$f":"E27","v":"Synergie 210"},"Sunex AMX 2,85","Sunex 2,0","Star Azzurro CPC","Billig VRK"]
["Leistung bei eingetragener Fläche (KW)",null,-70,{"$f":"IF(D84>0,(Eingaben!L107*D84*$B$6/1000)*$D$5/$D$4,0)","v":7.893523521600003E-2},{"$f":"IF(E84>0,(Eingaben!L107*E84*$B$6/1000)*$E$5/$E$4,0)","v":0},{"$f":"IF(F84>0,(Eingaben!L107*F84*$B$6/1000)*$F$5/$F$4,0)","v":4.4518523908013877E-2},{"$f":"IF(G84>0,(Eingaben!L107*G84*$B$6/1000)*$G$5/$G$4,0)","v":0},{"$f":"IF(H84>0,(Eingaben!L107*H84*$B$6/1000)*$H$5/$H$4,0)","v":0.80086898635102044},{"$f":"IF(I84>0,(Eingaben!L107*I84*$B$6/1000)*$I$5/$I$4,0)","v":0.33335083664842102}]
["Leistung bei eingetragener Fläche (KW)",null,-60,{"$f":"IF(D83>0,(Eingaben!L106*D83*$B$6/1000)*$D$5/$D$4,0)","v":0.7713593865120002},{"$f":"IF(E83>0,(Eingaben!L106*E83*$B$6/1000)*$E$5/$E$4,0)","v":0.64858257808695674},{"$f":"IF(F83>0,(Eingaben!L106*F83*$B$6/1000)*$F$5/$F$4,0)","v":0.75325566656445986},{"$f":"IF(G83>0,(Eingaben!L106*G83*$B$6/1000)*$G$5/$G$4,0)","v":0.61764447085714291},{"$f":"IF(H83>0,(Eingaben!L106*H83*$B$6/1000)*$H$5/$H$4,0)","v":1.3474186474285721},{"$f":"IF(I83>0,(Eingaben!L106*I83*$B$6/1000)*$I$5/$I$4,0)","v":1.0127783337247849}]
["Leistung bei eingetragener Fläche (KW)",null,-50,{"$f":"IF(D82>0,(Eingaben!L105*D82*$B$6/1000)*$D$5/$D$4,0)","v":1.3462548627480002},{"$f":"IF(E82>0,(Eingaben!L105*E82*$B$6/1000)*$E$5/$E$4,0)","v":1.1534904284753627},{"$f":"IF(F82>0,(Eingaben!L105*F82*$B$6/1000)*$F$5/$F$4,0)","v":1.285531348189547},{"$f":"IF(G82>0,(Eingaben!L105*G82*$B$6/1000)*$G$5/$G$4,0)","v":1.1311270456748772},{"$f":"IF(H82>0,(Eingaben!L105*H82*$B$6/1000)*$H$5/$H$4,0)","v":1.6437823056000005},{"$f":"IF(I82>0,(Eingaben!L105*I82*$B$6/1000)*$I$5/$I$4,0)","v":1.4482453894216269}]
["Leistung bei eingetragener Fläche (KW)",null,-40,{"$f":"IF(D81>0,(Eingaben!L104*D81*$B$6/1000)*$D$5/$D$4,0)","v":1.7110235704320003},{"$f":"IF(E81>0,(Eingaben!L104*E81*$B$6/1000)*$E$5/$E$4,0)","v":1.5116649865275367},{"$f":"IF(F81>0,(Eingaben!L104*F81*$B$6/1000)*$F$5/$F$4,0)","v":1.6632533441226476},{"$f":"IF(G81>0,(Eingaben!L104*G81*$B$6/1000)*$G$5/$G$4,0)","v":1.474980383779311},{"$f":"IF(H81>0,(Eingaben!L104*H81*$B$6/1000)*$H$5/$H$4,0)","v":1.9738080966857148},{"$f":"IF(I81>0,(Eingaben!L104*I81*$B$6/1000)*$I$5/$I$4,0)","v":1.6471877572899523}]
["Leistung bei eingetragener Fläche (KW)",null,-30,{"$f":"IF(D80>0,(Eingaben!L96*D80*$B$6/1000)*$D$5/$D$4,0)","v":2.1230746705080001},{"$f":"IF(E80>0,(Eingaben!L96*E80*$B$6/1000)*$E$5/$E$4,0)","v":1.8631188520811599},{"$f":"IF(F80>0,(Eingaben!L96*F80*$B$6/1000)*$F$5/$F$4,0)","v":2.0322956058146344},{"$f":"IF(G80>0,(Eingaben!L96*G80*$B$6/1000)*$G$5/$G$4,0)","v":1.8246755257379317},{"$f":"IF(H80>0,(Eingaben!L96*H80*$B$6/1000)*$H$5/$H$4,0)","v":2.245807375053062},{"$f":"IF(I80>0,(Eingaben!L96*I80*$B$6/1000)*$I$5/$I$4,0)","v":1.6976535297263158}]
["Leistung bei eingetragener Fläche (KW)",null,-20,{"$f":"IF(D79>0,(Eingaben!L95*D79*$B$6/1000)*$D$5/$D$4,0)","v":2.3980624242000017},{"$f":"IF(E79>0,(Eingaben!L95*E79*$B$6/1000)*$E$5/$E$4,0)","v":2.1196381214608708},{"$f":"IF(F79>0,(Eingaben!L95*F79*$B$6/1000)*$F$5/$F$4,0)","v":2.3018735780780495},{"$f":"IF(G79>0,(Eingaben!L95*G79*$B$6/1000)*$G$5/$G$4,0)","v":2.0798262830660108},{"$f":"IF(H79>0,(Eingaben!L95*H79*$B$6/1000)*$H$5/$H$4,0)","v":2.4123224888326535},{"$f":"IF(I79>0,(Eingaben!L95*I79*$B$6/1000)*$I$5/$I$4,0)","v":1.6875326303142588}]
["Leistung bei eingetragener Fläche (KW)",null,-10,{"$f":"IF(D78>0,(Eingaben!L94*D78*$B$6/1000)*$D$5/$D$4,0)","v":2.5348949142000006},{"$f":"IF(E78>0,(Eingaben!L94*E78*$B$6/1000)*$E$5/$E$4,0)","v":2.2705221843478265},{"$f":"IF(F78>0,(Eingaben!L94*F78*$B$6/1000)*$F$5/$F$4,0)","v":2.4607760834843213},{"$f":"IF(G78>0,(Eingaben!L94*G78*$B$6/1000)*$G$5/$G$4,0)","v":2.2297760283743853},{"$f":"IF(H78>0,(Eingaben!L94*H78*$B$6/1000)*$H$5/$H$4,0)","v":2.5140703670367359},{"$f":"IF(I78>0,(Eingaben!L94*I78*$B$6/1000)*$I$5/$I$4,0)","v":1.7016408677129184}]
["Leistung bei eingetragener Fläche (KW)",null,0,{"$f":"IF(D77>0,(Eingaben!L93*D77*$B$6/1000)*$D$5/$D$4,0)","v":2.5791642492000011},{"$f":"IF(E77>0,(Eingaben!L93*E77*$B$6/1000)*$E$5/$E$4,0)","v":2.3124106944927543},{"$f":"IF(F77>0,(Eingaben!L93*F77*$B$6/1000)*$F$5/$F$4,0)","v":2.504663254912892},{"$f":"IF(G77>0,(Eingaben!L93*G77*$B$6/1000)*$G$5/$G$4,0)","v":2.2714923633497546},{"$f":"IF(H77>0,(Eingaben!L93*H77*$B$6/1000)*$H$5/$H$4,0)","v":2.5217710873469392},{"$f":"IF(I77>0,(Eingaben!L93*I77*$B$6/1000)*$I$5/$I$4,0)","v":1.7272040066602872}]
["Leistung bei eingetragener Fläche (KW)",null,10,{"$f":"IF(D78>0,(Eingaben!L94*D78*$B$6/1000)*$D$5/$D$4,0)","v":2.5348949142000006},{"$f":"IF(E78>0,(Eingaben!L94*E78*$B$6/1000)*$E$5/$E$4,0)","v":2.2705221843478265},{"$f":"IF(F78>0,(Eingaben!L94*F78*$B$6/1000)*$F$5/$F$4,0)","v":2.4607760834843213},{"$f":"IF(G78>0,(Eingaben!L94*G78*$B$6/1000)*$G$5/$G$4,0)","v":2.2297760283743853},{"$f":"IF(H78>0,(Eingaben!L94*H78*$B$6/1000)*$H$5/$H$4,0)","v":2.5140703670367359},{"$f":"IF(I78>0,(Eingaben!L94*I78*$B$6/1000)*$I$5/$I$4,0)","v":1.7016408677129184}]
["Leistung bei eingetragener Fläche (KW)",null,20,{"$f":"IF(D79>0,(Eingaben!L95*D79*$B$6/1000)*$D$5/$D$4,0)","v":2.3980624242000017},{"$f":"IF(E79>0,(Eingaben!L95*E79*$B$6/1000)*$E$5/$E$4,0)","v":2.1196381214608708},{"$f":"IF(F79>0,(Eingaben!L95*F79*$B$6/1000)*$F$5/$F$4,0)","v":2.3018735780780495},{"$f":"IF(G79>0,(Eingaben!L95*G79*$B$6/1000)*$G$5/$G$4,0)","v":2.0798262830660108},{"$f":"IF(H79>0,(Eingaben!L95*H79*$B$6/1000)*$H$5/$H$4,0)","v":2.4123224888326535},{"$f":"IF(I79>0,(Eingaben!L95*I79*$B$6/1000)*$I$5/$I$4,0)","v":1.6875326303142588}]
["Leistung bei eingetragener Fläche (KW)",null,30,{"$f":"IF(D80>0,(Eingaben!L96*D80*$B$6/1000)*$D$5/$D$4,0)","v":2.1230746705080001},{"$f":"IF(E80>0,(Eingaben!L96*E80*$B$6/1000)*$E$5/$E$4,0)","v":1.8631188520811599},{"$f":"IF(F80>0,(Eingaben!L96*F80*$B$6/1000)*$F$5/$F$4,0)","v":2.0322956058146344},{"$f":"IF(G80>0,(Eingaben!L96*G80*$B$6/1000)*$G$5/$G$4,0)","v":1.8246755257379317},{"$f":"IF(H80>0,(Eingaben!L96*H80*$B$6/1000)*$H$5/$H$4,0)","v":2.245807375053062},{"$f":"IF(I80>0,(Eingaben!L96*I80*$B$6/1000)*$I$5/$I$4,0)","v":1.6976535297263158}]
["Leistung bei eingetragener Fläche (KW)",null,40,{"$f":"IF(D81>0,(Eingaben!L104*D81*$B$6/1000)*$D$5/$D$4,0)","v":1.7110235704320003},{"$f":"IF(E81>0,(Eingaben!L104*E81*$B$6/1000)*$E$5/$E$4,0)","v":1.5116649865275367},{"$f":"IF(F81>0,(Eingaben!L104*F81*$B$6/1000)*$F$5/$F$4,0)","v":1.6632533441226476},{"$f":"IF(G81>0,(Eingaben!L104*G81*$B$6/1000)*$G$5/$G$4,0)","v":1.474980383779311},{"$f":"IF(H81>0,(Eingaben!L104*H81*$B$6/1000)*$H$5/$H$4,0)","v":1.9738080966857148},{"$f":"IF(I81>0,(Eingaben!L104*I81*$B$6/1000)*$I$5/$I$4,0)","v":1.6471877572899523}]
["Leistung bei eingetragener Fläche (KW)",null,50,{"$f":"IF(D82>0,(Eingaben!L105*D82*$B$6/1000)*$D$5/$D$4,0)","v":1.3462548627480002},{"$f":"IF(E82>0,(Eingaben!L105*E82*$B$6/1000)*$E$5/$E$4,0)","v":1.1534904284753627},{"$f":"IF(F82>0,(Eingaben!L105*F82*$B$6/1000)*$F$5/$F$4,0)","v":1.285531348189547},{"$f":"IF(G82>0,(Eingaben!L105*G82*$B$6/1000)*$G$5/$G$4,0)","v":1.1311270456748772},{"$f":"IF(H82>0,(Eingaben!L105*H82*$B$6/1000)*$H$5/$H$4,0)","v":1.6437823056000005},{"$f":"IF(I82>0,(Eingaben!L105*I82*$B$6/1000)*$I$5/$I$4,0)","v":1.4482453894216269}]
["Leistung bei eingetragener Fläche (KW)",null,60,{"$f":"IF(D83>0,(Eingaben!L106*D83*$B$6/1000)*$D$5/$D$4,0)","v":0.7713593865120002},{"$f":"IF(E83>0,(Eingaben!L106*E83*$B$6/1000)*$E$5/$E$4,0)","v":0.64858257808695674},{"$f":"IF(F83>0,(Eingaben!L106*F83*$B$6/1000)*$F$5/$F$4,0)","v":0.75325566656445986},{"$f":"IF(G83>0,(Eingaben!L106*G83*$B$6/1000)*$G$5/$G$4,0)","v":0.61764447085714291},{"$f":"IF(H83>0,(Eingaben!L106*H83*$B$6/1000)*$H$5/$H$4,0)","v":1.3474186474285721},{"$f":"IF(I83>0,(Eingaben!L106*I83*$B$6/1000)*$I$5/$I$4,0)","v":1.0127783337247849}]
["Leistung bei eingetragener Fläche (KW)",null,70,{"$f":"IF(D84>0,(Eingaben!L107*D84*$B$6/1000)*$D$5/$D$4,0)","v":7.893523521600003E-2},{"$f":"IF(E84>0,(Eingaben!L107*E84*$B$6/1000)*$E$5/$E$4,0)","v":0},{"$f":"IF(F84>0,(Eingaben!L107*F84*$B$6/1000)*$F$5/$F$4,0)","v":4.4518523908013877E-2},{"$f":"IF(G84>0,(Eingaben!L107*G84*$B$6/1000)*$G$5/$G$4,0)","v":0},{"$f":"IF(H84>0,(Eingaben!L107*H84*$B$6/1000)*$H$5/$H$4,0)","v":0.80086898635102044},{"$f":"IF(I84>0,(Eingaben!L107*I84*$B$6/1000)*$I$5/$I$4,0)","v":0.33335083664842102}]
["KW Schnitt  > ",null,null,{"$f":"SUM(D86:D100)/15","v":1.6337582917888007},{"$f":"SUM(E86:E100)/15","v":1.4297629997634786},1.5725114370157491,1.3991701225552715,1.8931951747548306,1.3855988464224562]
["KWH gesamt bei Azimut -70 bis +70 > ",null,null,{"$f":"IF(D101>0,D101*$B$17,0)","v":13.886945480204806},12.152985497989569,13.366347214633867,11.892946041719808,16.092158985416059,11.777590194590879]
["Puffervolumen (L) > ",{"$f":"B45","v":1500},"Erwärmung (K)>",{"$f":"IF(D102>0,D102/(($B$45/1000)*1*1.163),0)","v":7.9604158671280061},{"$f":"IF(E102>0,E102/(($B$45/1000)*1*1.163),0)","v":6.9664577231238578},7.6619932442727814,6.8173952661047919,9.2245107397053943,6.7512698163318312]
["Laufzeit gesamt (Std.) > ",{"$f":"B17","v":8.5},{"$f":"\"Berechnung nach Tagesverlauf bei starker Bewölkung (mit IAM) mit Diff. \"&B5&\"  bei  \"&B6&\" m²\"&\"  am \"","v":"Berechnung nach Tagesverlauf bei starker Bewölkung (mit IAM) mit Diff. 32  bei  10,46 m²  am "},null,null,null,null,{"$f":"H17","v":"2013-09-23"}]
["Wirkungsgrad bei  Diff.0  > ",null,null,{"$f":"$D$6-$D$7*(0/1000)-$D$8*1000*((0/1000*0/1000))","v":0.81},{"$f":"$E$6-$E$7*(0/1000)-$E$8*1000*((0/1000*0/1000))","v":0.78500000000000003},{"$f":"$F$6-$F$7*(0/1000)-$F$8*1000*((0/1000*0/1000))","v":0.82},{"$f":"$G$6-$G$7*(0/1000)-$G$8*1000*((0/1000*0/1000))","v":0.8},{"$f":"$H$6-$H$7*(0/1000)-$H$8*1000*((0/1000*0/1000))","v":0.64},{"$f":"$I$6-$I$7*(0/1000)-$I$8*1000*((0/1000*0/1000))","v":0.65400000000000003}]
["Wirkungsgrad bei eingestellter Diff. bei   0° >",null,null,{"$f":"IF(Eingaben!L135>0,($D$6-$D$7*($B$5/Eingaben!L135)-$D$8*Eingaben!L135*(($B$5/Eingaben!L135*$B$5/Eingaben!L135)))*$D$9,0)","v":0.29212993630573253},{"$f":"IF(Eingaben!L135>0,($E$6-$E$7*($B$5/Eingaben!L135)-$E$8*Eingaben!L135*(($B$5/Eingaben!L135*$B$5/Eingaben!L135)))*$E$9,0)","v":0.22707218683651814},{"$f":"IF(Eingaben!L135>0,($F$6-$F$7*($B$5/Eingaben!L135)-$F$8*Eingaben!L135*(($B$5/Eingaben!L135*$B$5/Eingaben!L135)))*$F$9,0)","v":0.27294267515923559},{"$f":"IF(Eingaben!L135>0,($G$6-$G$7*($B$5/Eingaben!L135)-$G$8*Eingaben!L135*(($B$5/Eingaben!L135*$B$5/Eingaben!L135)))*$G$9,0)","v":0.21734182590233547},{"$f":"IF(Eingaben!L135>0,($H$6-$H$7*($B$5/Eingaben!L135)-$H$8*Eingaben!L135*(($B$5/Eingaben!L135*$B$5/Eingaben!L135)))*$H$9,0)","v":0.516484076433121},{"$f":"IF(Eingaben!L135>0,($I$6-$I$7*($B$5/Eingaben!L135)-$I$8*Eingaben!L135*(($B$5/Eingaben!L135*$B$5/Eingaben!L135)))*$I$9,0)","v":0.37799830148619956}]
["Wirkungsgrad bei eingestellter Diff. bei 10° >",null,null,{"$f":"IF(Eingaben!L136>0,($D$6-$D$7*($B$5/Eingaben!L136)-$D$8*Eingaben!L136*(($B$5/Eingaben!L136*$B$5/Eingaben!L136)))*$D$10,0)","v":0.28601117078410321},{"$f":"IF(Eingaben!L136>0,($E$6-$E$7*($B$5/Eingaben!L136)-$E$8*Eingaben!L136*(($B$5/Eingaben!L136*$B$5/Eingaben!L136)))*$E$10,0)","v":0.22048012889366278},{"$f":"IF(Eingaben!L136>0,($F$6-$F$7*($B$5/Eingaben!L136)-$F$8*Eingaben!L136*(($B$5/Eingaben!L136*$B$5/Eingaben!L136)))*$F$10,0)","v":0.26647905477980666},{"$f":"IF(Eingaben!L136>0,($G$6-$G$7*($B$5/Eingaben!L136)-$G$8*Eingaben!L136*(($B$5/Eingaben!L136*$B$5/Eingaben!L136)))*$G$10,0)","v":0.21045757250268535},{"$f":"IF(Eingaben!L136>0,($H$6-$H$7*($B$5/Eingaben!L136)-$H$8*Eingaben!L136*(($B$5/Eingaben!L136*$B$5/Eingaben!L136)))*$H$10,0)","v":0.52017495166487648},{"$f":"IF(Eingaben!L136>0,($I$6-$I$7*($B$5/Eingaben!L136)-$I$8*Eingaben!L136*(($B$5/Eingaben!L136*$B$5/Eingaben!L136)))*$I$10,0)","v":0.37473727175080557}]
["Wirkungsgrad bei eingestellter Diff. bei 20° >",null,null,{"$f":"IF(Eingaben!L137>0,($D$6-$D$7*($B$5/Eingaben!L137)-$D$8*Eingaben!L137*(($B$5/Eingaben!L137*$B$5/Eingaben!L137)))*$D$11,0)","v":0.26614983277591991},{"$f":"IF(Eingaben!L137>0,($E$6-$E$7*($B$5/Eingaben!L137)-$E$8*Eingaben!L137*(($B$5/Eingaben!L137*$B$5/Eingaben!L137)))*$E$11,0)","v":0.19709167224080287},{"$f":"IF(Eingaben!L137>0,($F$6-$F$7*($B$5/Eingaben!L137)-$F$8*Eingaben!L137*(($B$5/Eingaben!L137*$B$5/Eingaben!L137)))*$F$11,0)","v":0.24304334448160539},{"$f":"IF(Eingaben!L137>0,($G$6-$G$7*($B$5/Eingaben!L137)-$G$8*Eingaben!L137*(($B$5/Eingaben!L137*$B$5/Eingaben!L137)))*$G$11,0)","v":0.18623036789297676},{"$f":"IF(Eingaben!L137>0,($H$6-$H$7*($B$5/Eingaben!L137)-$H$8*Eingaben!L137*(($B$5/Eingaben!L137*$B$5/Eingaben!L137)))*$H$11,0)","v":0.51539050167224087},{"$f":"IF(Eingaben!L137>0,($I$6-$I$7*($B$5/Eingaben!L137)-$I$8*Eingaben!L137*(($B$5/Eingaben!L137*$B$5/Eingaben!L137)))*$I$11,0)","v":0.37871814492753636}]
["Wirkungsgrad bei eingestellter Diff. bei 30° >",null,null,{"$f":"IF(Eingaben!L138>0,($D$6-$D$7*($B$5/Eingaben!L138)-$D$8*Eingaben!L138*(($B$5/Eingaben!L138*$B$5/Eingaben!L138)))*$D$12,0)","v":0.22281694964028784},{"$f":"IF(Eingaben!L138>0,($E$6-$E$7*($B$5/Eingaben!L138)-$E$8*Eingaben!L138*(($B$5/Eingaben!L138*$B$5/Eingaben!L138)))*$E$12,0)","v":0.15172609112709834},{"$f":"IF(Eingaben!L138>0,($F$6-$F$7*($B$5/Eingaben!L138)-$F$8*Eingaben!L138*(($B$5/Eingaben!L138*$B$5/Eingaben!L138)))*$F$12,0)","v":0.19805870503597126},{"$f":"IF(Eingaben!L138>0,($G$6-$G$7*($B$5/Eingaben!L138)-$G$8*Eingaben!L138*(($B$5/Eingaben!L138*$B$5/Eingaben!L138)))*$G$12,0)","v":0.13905189448441257},{"$f":"IF(Eingaben!L138>0,($H$6-$H$7*($B$5/Eingaben!L138)-$H$8*Eingaben!L138*(($B$5/Eingaben!L138*$B$5/Eingaben!L138)))*$H$12,0)","v":0.51049899280575539},{"$f":"IF(Eingaben!L138>0,($I$6-$I$7*($B$5/Eingaben!L138)-$I$8*Eingaben!L138*(($B$5/Eingaben!L138*$B$5/Eingaben!L138)))*$I$12,0)","v":0.3935956354916067}]
["Wirkungsgrad bei eingestellter Diff. bei 40° >",null,null,{"$f":"IF(Eingaben!L139>0,($D$6-$D$7*($B$5/Eingaben!L139)-$D$8*Eingaben!L139*(($B$5/Eingaben!L139*$B$5/Eingaben!L139)))*$D$13,0)","v":0.14813729032258063},{"$f":"IF(Eingaben!L139>0,($E$6-$E$7*($B$5/Eingaben!L139)-$E$8*Eingaben!L139*(($B$5/Eingaben!L139*$B$5/Eingaben!L139)))*$E$13,0)","v":7.6233655913978501E-2},{"$f":"IF(Eingaben!L139>0,($F$6-$F$7*($B$5/Eingaben!L139)-$F$8*Eingaben!L139*(($B$5/Eingaben!L139*$B$5/Eingaben!L139)))*$F$13,0)","v":0.12353419354838704},{"$f":"IF(Eingaben!L139>0,($G$6-$G$7*($B$5/Eingaben!L139)-$G$8*Eingaben!L139*(($B$5/Eingaben!L139*$B$5/Eingaben!L139)))*$G$13,0)","v":6.0411182795698855E-2},{"$f":"IF(Eingaben!L139>0,($H$6-$H$7*($B$5/Eingaben!L139)-$H$8*Eingaben!L139*(($B$5/Eingaben!L139*$B$5/Eingaben!L139)))*$H$13,0)","v":0.49328516129032263},{"$f":"IF(Eingaben!L139>0,($I$6-$I$7*($B$5/Eingaben!L139)-$I$8*Eingaben!L139*(($B$5/Eingaben!L139*$B$5/Eingaben!L139)))*$I$13,0)","v":0.39591010752688172}]
["Wirkungsgrad bei eingestellter Diff. bei 50° >",null,null,{"$f":"IF(Eingaben!L140>0,($D$6-$D$7*($B$5/Eingaben!L140)-$D$8*Eingaben!L140*(($B$5/Eingaben!L140*$B$5/Eingaben!L140)))*$D$14,0)","v":6.343411872146125E-2},{"$f":"IF(Eingaben!L140>0,($E$6-$E$7*($B$5/Eingaben!L140)-$E$8*Eingaben!L140*(($B$5/Eingaben!L140*$B$5/Eingaben!L140)))*$E$14,0)","v":-1.4054216133942088E-2},{"$f":"IF(Eingaben!L140>0,($F$6-$F$7*($B$5/Eingaben!L140)-$F$8*Eingaben!L140*(($B$5/Eingaben!L140*$B$5/Eingaben!L140)))*$F$14,0)","v":3.3496621004566192E-2},{"$f":"IF(Eingaben!L140>0,($G$6-$G$7*($B$5/Eingaben!L140)-$G$8*Eingaben!L140*(($B$5/Eingaben!L140*$B$5/Eingaben!L140)))*$G$14,0)","v":-3.3638964992389608E-2},{"$f":"IF(Eingaben!L140>0,($H$6-$H$7*($B$5/Eingaben!L140)-$H$8*Eingaben!L140*(($B$5/Eingaben!L140*$B$5/Eingaben!L140)))*$H$14,0)","v":0.45364602739726029},{"$f":"IF(Eingaben!L140>0,($I$6-$I$7*($B$5/Eingaben!L140)-$I$8*Eingaben!L140*(($B$5/Eingaben!L140*$B$5/Eingaben!L140)))*$I$14,0)","v":0.35124929071537303}]
["Wirkungsgrad bei eingestellter Diff. bei 60° >",null,null,{"$f":"IF(Eingaben!L141>0,($D$6-$D$7*($B$5/Eingaben!L141)-$D$8*Eingaben!L141*(($B$5/Eingaben!L141*$B$5/Eingaben!L141)))*$D$15,0)","v":-0.10404293129770985},{"$f":"IF(Eingaben!L141>0,($E$6-$E$7*($B$5/Eingaben!L141)-$E$8*Eingaben!L141*(($B$5/Eingaben!L141*$B$5/Eingaben!L141)))*$E$15,0)","v":-0.19619312977099229},{"$f":"IF(Eingaben!L141>0,($F$6-$F$7*($B$5/Eingaben!L141)-$F$8*Eingaben!L141*(($B$5/Eingaben!L141*$B$5/Eingaben!L141)))*$F$15,0)","v":-0.14710534351145041},{"$f":"IF(Eingaben!L141>0,($G$6-$G$7*($B$5/Eingaben!L141)-$G$8*Eingaben!L141*(($B$5/Eingaben!L141*$B$5/Eingaben!L141)))*$G$15,0)","v":-0.22270534351145038},{"$f":"IF(Eingaben!L141>0,($H$6-$H$7*($B$5/Eingaben!L141)-$H$8*Eingaben!L141*(($B$5/Eingaben!L141*$B$5/Eingaben!L141)))*$H$15,0)","v":0.4388519083969466},{"$f":"IF(Eingaben!L141>0,($I$6-$I$7*($B$5/Eingaben!L141)-$I$8*Eingaben!L141*(($B$5/Eingaben!L141*$B$5/Eingaben!L141)))*$I$15,0)","v":0.21149087022900767}]
["Wirkungsgrad bei eingestellter Diff. bei 70° >",null,null,{"$f":"IF(Eingaben!L142>0,($D$6-$D$7*($B$5/Eingaben!L142)-$D$8*Eingaben!L142*(($B$5/Eingaben!L142*$B$5/Eingaben!L142)))*$D$16,0)","v":-0.49442721951219515},{"$f":"IF(Eingaben!L142>0,($E$6-$E$7*($B$5/Eingaben!L142)-$E$8*Eingaben!L142*(($B$5/Eingaben!L142*$B$5/Eingaben!L142)))*$E$16,0)","v":-0.65387317073170736},{"$f":"IF(Eingaben!L142>0,($F$6-$F$7*($B$5/Eingaben!L142)-$F$8*Eingaben!L142*(($B$5/Eingaben!L142*$B$5/Eingaben!L142)))*$F$16,0)","v":-0.60840878048780489},{"$f":"IF(Eingaben!L142>0,($G$6-$G$7*($B$5/Eingaben!L142)-$G$8*Eingaben!L142*(($B$5/Eingaben!L142*$B$5/Eingaben!L142)))*$G$16,0)","v":-0.70742634146341477},{"$f":"IF(Eingaben!L142>0,($H$6-$H$7*($B$5/Eingaben!L142)-$H$8*Eingaben!L142*(($B$5/Eingaben!L142*$B$5/Eingaben!L142)))*$H$16,0)","v":0.32520585365853655},{"$f":"IF(Eingaben!L142>0,($I$6-$I$7*($B$5/Eingaben!L142)-$I$8*Eingaben!L142*(($B$5/Eingaben!L142*$B$5/Eingaben!L142)))*$I$16,0)","v":-0.1539163902439025}]
["Leistung nach Tagesverlauf  ",null,"Azimut",{"$f":"D27","v":"SolRose 26"},{"$f":"E27","v":"Synergie 210"},"Sunex AMX 2,85","Sunex 2,0","Star Azzurro CPC","Billig VRK"]
["Leistung bei eingetragener Fläche (KW)",null,-70,{"$f":"IF(D113>0,(Eingaben!L142*D113*$B$6/1000)*$D$5/$D$4,0)","v":0},{"$f":"IF(E113>0,(Eingaben!L142*E113*$B$6/1000)*$E$5/$E$4,0)","v":0},{"$f":"IF(F113>0,(Eingaben!L142*F113*$B$6/1000)*$F$5/$F$4,0)","v":0},{"$f":"IF(G113>0,(Eingaben!L142*G113*$B$6/1000)*$G$5/$G$4,0)","v":0},{"$f":"IF(H113>0,(Eingaben!L142*H113*$B$6/1000)*$H$5/$H$4,0)","v":0.24691490047346931},{"$f":"IF(I113>0,(Eingaben!L142*I113*$B$6/1000)*$I$5/$I$4,0)","v":0}]
["Leistung bei eingetragener Fläche (KW)",null,-60,{"$f":"IF(D112>0,(Eingaben!L141*D112*$B$6/1000)*$D$5/$D$4,0)","v":0},{"$f":"IF(E112>0,(Eingaben!L141*E112*$B$6/1000)*$E$5/$E$4,0)","v":0},{"$f":"IF(F112>0,(Eingaben!L141*F112*$B$6/1000)*$F$5/$F$4,0)","v":0},{"$f":"IF(G112>0,(Eingaben!L141*G112*$B$6/1000)*$G$5/$G$4,0)","v":0},{"$f":"IF(H112>0,(Eingaben!L141*H112*$B$6/1000)*$H$5/$H$4,0)","v":0.53230969885714285},{"$f":"IF(I112>0,(Eingaben!L141*I112*$B$6/1000)*$I$5/$I$4,0)","v":0.19689589539368424}]
["Leistung bei eingetragener Fläche (KW)",null,-50,{"$f":"IF(D111>0,(Eingaben!L140*D111*$B$6/1000)*$D$5/$D$4,0)","v":0.10353413959800012},{"$f":"IF(E111>0,(Eingaben!L140*E111*$B$6/1000)*$E$5/$E$4,0)","v":0},{"$f":"IF(F111>0,(Eingaben!L140*F111*$B$6/1000)*$F$5/$F$4,0)","v":5.3538651332404159E-2},{"$f":"IF(G111>0,(Eingaben!L140*G111*$B$6/1000)*$G$5/$G$4,0)","v":0},{"$f":"IF(H111>0,(Eingaben!L140*H111*$B$6/1000)*$H$5/$H$4,0)","v":0.68991816960000008},{"$f":"IF(I111>0,(Eingaben!L140*I111*$B$6/1000)*$I$5/$I$4,0)","v":0.41001012068287102}]
["Leistung bei eingetragener Fläche (KW)",null,-40,{"$f":"IF(D110>0,(Eingaben!L139*D110*$B$6/1000)*$D$5/$D$4,0)","v":0.27379948723200004},{"$f":"IF(E110>0,(Eingaben!L139*E110*$B$6/1000)*$E$5/$E$4,0)","v":0.13756953191884061},{"$f":"IF(F110>0,(Eingaben!L139*F110*$B$6/1000)*$F$5/$F$4,0)","v":0.22359453155121942},{"$f":"IF(G110>0,(Eingaben!L139*G110*$B$6/1000)*$G$5/$G$4,0)","v":0.10653290082364524},{"$f":"IF(H110>0,(Eingaben!L139*H110*$B$6/1000)*$H$5/$H$4,0)","v":0.84954441276734705},{"$f":"IF(I110>0,(Eingaben!L139*I110*$B$6/1000)*$I$5/$I$4,0)","v":0.5233392122947369}]
["Leistung bei eingetragener Fläche (KW)",null,-30,{"$f":"IF(D109>0,(Eingaben!L138*D109*$B$6/1000)*$D$5/$D$4,0)","v":0.46164652795800021},{"$f":"IF(E109>0,(Eingaben!L138*E109*$B$6/1000)*$E$5/$E$4,0)","v":0.30692261973333335},{"$f":"IF(F109>0,(Eingaben!L138*F109*$B$6/1000)*$F$5/$F$4,0)","v":0.40184728981463419},{"$f":"IF(G109>0,(Eingaben!L138*G109*$B$6/1000)*$G$5/$G$4,0)","v":0.27487575746206921},{"$f":"IF(H109>0,(Eingaben!L138*H109*$B$6/1000)*$H$5/$H$4,0)","v":0.98554405195102068},{"$f":"IF(I109>0,(Eingaben!L138*I109*$B$6/1000)*$I$5/$I$4,0)","v":0.58321686770717707}]
["Leistung bei eingetragener Fläche (KW)",null,-20,{"$f":"IF(D108>0,(Eingaben!L137*D108*$B$6/1000)*$D$5/$D$4,0)","v":0.59308090170000061},{"$f":"IF(E108>0,(Eingaben!L137*E108*$B$6/1000)*$E$5/$E$4,0)","v":0.42880840946087018},{"$f":"IF(F108>0,(Eingaben!L137*F108*$B$6/1000)*$F$5/$F$4,0)","v":0.53036790336376327},{"$f":"IF(G108>0,(Eingaben!L137*G108*$B$6/1000)*$G$5/$G$4,0)","v":0.39594642178522216},{"$f":"IF(H108>0,(Eingaben!L137*H108*$B$6/1000)*$H$5/$H$4,0)","v":1.0701482719346942},{"$f":"IF(I108>0,(Eingaben!L137*I108*$B$6/1000)*$I$5/$I$4,0)","v":0.60356258207693814}]
["Leistung bei eingetragener Fläche (KW)",null,-10,{"$f":"IF(D107>0,(Eingaben!L136*D107*$B$6/1000)*$D$5/$D$4,0)","v":0.66149714670000037},{"$f":"IF(E107>0,(Eingaben!L136*E107*$B$6/1000)*$E$5/$E$4,0)","v":0.4978765959420291},{"$f":"IF(F107>0,(Eingaben!L136*F107*$B$6/1000)*$F$5/$F$4,0)","v":0.60355078348432056},{"$f":"IF(G107>0,(Eingaben!L136*G107*$B$6/1000)*$G$5/$G$4,0)","v":0.46441658009852238},{"$f":"IF(H107>0,(Eingaben!L136*H107*$B$6/1000)*$H$5/$H$4,0)","v":1.1210222110367349},{"$f":"IF(I107>0,(Eingaben!L136*I107*$B$6/1000)*$I$5/$I$4,0)","v":0.61985530589473692}]
["Leistung bei eingetragener Fläche (KW)",null,0,{"$f":"IF(D106>0,(Eingaben!L135*D106*$B$6/1000)*$D$5/$D$4,0)","v":0.68363181420000019},{"$f":"IF(E106>0,(Eingaben!L135*E106*$B$6/1000)*$E$5/$E$4,0)","v":0.51882085101449293},{"$f":"IF(F106>0,(Eingaben!L135*F106*$B$6/1000)*$F$5/$F$4,0)","v":0.62549436919860602},{"$f":"IF(G106>0,(Eingaben!L135*G106*$B$6/1000)*$G$5/$G$4,0)","v":0.48527474758620703},{"$f":"IF(H106>0,(Eingaben!L135*H106*$B$6/1000)*$H$5/$H$4,0)","v":1.1262192342857145},{"$f":"IF(I106>0,(Eingaben!L135*I106*$B$6/1000)*$I$5/$I$4,0)","v":0.63263687536842095}]
["Leistung bei eingetragener Fläche (KW)",null,10,{"$f":"IF(D107>0,(Eingaben!L136*D107*$B$6/1000)*$D$5/$D$4,0)","v":0.66149714670000037},{"$f":"IF(E107>0,(Eingaben!L136*E107*$B$6/1000)*$E$5/$E$4,0)","v":0.4978765959420291},{"$f":"IF(F107>0,(Eingaben!L136*F107*$B$6/1000)*$F$5/$F$4,0)","v":0.60355078348432056},{"$f":"IF(G107>0,(Eingaben!L136*G107*$B$6/1000)*$G$5/$G$4,0)","v":0.46441658009852238},{"$f":"IF(H107>0,(Eingaben!L136*H107*$B$6/1000)*$H$5/$H$4,0)","v":1.1210222110367349},{"$f":"IF(I107>0,(Eingaben!L136*I107*$B$6/1000)*$I$5/$I$4,0)","v":0.61985530589473692}]
["Leistung bei eingetragener Fläche (KW)",null,20,{"$f":"IF(D108>0,(Eingaben!L137*D108*$B$6/1000)*$D$5/$D$4,0)","v":0.59308090170000061},{"$f":"IF(E108>0,(Eingaben!L137*E108*$B$6/1000)*$E$5/$E$4,0)","v":0.42880840946087018},{"$f":"IF(F108>0,(Eingaben!L137*F108*$B$6/1000)*$F$5/$F$4,0)","v":0.53036790336376327},{"$f":"IF(G108>0,(Eingaben!L137*G108*$B$6/1000)*$G$5/$G$4,0)","v":0.39594642178522216},{"$f":"IF(H108>0,(Eingaben!L137*H108*$B$6/1000)*$H$5/$H$4,0)","v":1.0701482719346942},{"$f":"IF(I108>0,(Eingaben!L137*I108*$B$6/1000)*$I$5/$I$4,0)","v":0.60356258207693814}]
["Leistung bei eingetragener Fläche (KW)",null,30,{"$f":"IF(D109>0,(Eingaben!L138*D109*$B$6/1000)*$D$5/$D$4,0)","v":0.46164652795800021},{"$f":"IF(E109>0,(Eingaben!L138*E109*$B$6/1000)*$E$5/$E$4,0)","v":0.30692261973333335},{"$f":"IF(F109>0,(Eingaben!L138*F109*$B$6/1000)*$F$5/$F$4,0)","v":0.40184728981463419},{"$f":"IF(G109>0,(Eingaben!L138*G109*$B$6/1000)*$G$5/$G$4,0)","v":0.27487575746206921},{"$f":"IF(H109>0,(Eingaben!L138*H109*$B$6/1000)*$H$5/$H$4,0)","v":0.98554405195102068},{"$f":"IF(I109>0,(Eingaben!L138*I109*$B$6/1000)*$I$5/$I$4,0)","v":0.58321686770717707}]
["Leistung bei eingetragener Fläche (KW)",null,40,{"$f":"IF(D110>0,(Eingaben!L139*D110*$B$6/1000)*$D$5/$D$4,0)","v":0.27379948723200004},{"$f":"IF(E110>0,(Eingaben!L139*E110*$B$6/1000)*$E$5/$E$4,0)","v":0.13756953191884061},{"$f":"IF(F110>0,(Eingaben!L139*F110*$B$6/1000)*$F$5/$F$4,0)","v":0.22359453155121942},{"$f":"IF(G110>0,(Eingaben!L139*G110*$B$6/1000)*$G$5/$G$4,0)","v":0.10653290082364524},{"$f":"IF(H110>0,(Eingaben!L139*H110*$B$6/1000)*$H$5/$H$4,0)","v":0.84954441276734705},{"$f":"IF(I110>0,(Eingaben!L139*I110*$B$6/1000)*$I$5/$I$4,0)","v":0.5233392122947369}]
["Leistung bei eingetragener Fläche (KW)",null,50,{"$f":"IF(D111>0,(Eingaben!L140*D111*$B$6/1000)*$D$5/$D$4,0)","v":0.10353413959800012},{"$f":"IF(E111>0,(Eingaben!L140*E111*$B$6/1000)*$E$5/$E$4,0)","v":0},{"$f":"IF(F111>0,(Eingaben!L140*F111*$B$6/1000)*$F$5/$F$4,0)","v":5.3538651332404159E-2},{"$f":"IF(G111>0,(Eingaben!L140*G111*$B$6/1000)*$G$5/$G$4,0)","v":0},{"$f":"IF(H111>0,(Eingaben!L140*H111*$B$6/1000)*$H$5/$H$4,0)","v":0.68991816960000008},{"$f":"IF(I111>0,(Eingaben!L140*I111*$B$6/1000)*$I$5/$I$4,0)","v":0.41001012068287102}]
["Leistung bei eingetragener Fläche (KW)",null,60,{"$f":"IF(D112>0,(Eingaben!L141*D112*$B$6/1000)*$D$5/$D$4,0)","v":0},{"$f":"IF(E112>0,(Eingaben!L141*E112*$B$6/1000)*$E$5/$E$4,0)","v":0},{"$f":"IF(F112>0,(Eingaben!L141*F112*$B$6/1000)*$F$5/$F$4,0)","v":0},{"$f":"IF(G112>0,(Eingaben!L141*G112*$B$6/1000)*$G$5/$G$4,0)","v":0},{"$f":"IF(H112>0,(Eingaben!L141*H112*$B$6/1000)*$H$5/$H$4,0)","v":0.53230969885714285},{"$f":"IF(I112>0,(Eingaben!L141*I112*$B$6/1000)*$I$5/$I$4,0)","v":0.19689589539368424}]
["Leistung bei eingetragener Fläche (KW)",null,70,{"$f":"IF(D113>0,(Eingaben!L142*D113*$B$6/1000)*$D$5/$D$4,0)","v":0},{"$f":"IF(E113>0,(Eingaben!L142*E113*$B$6/1000)*$E$5/$E$4,0)","v":0},{"$f":"IF(F113>0,(Eingaben!L142*F113*$B$6/1000)*$F$5/$F$4,0)","v":0},{"$f":"IF(G113>0,(Eingaben!L142*G113*$B$6/1000)*$G$5/$G$4,0)","v":0},{"$f":"IF(H113>0,(Eingaben!L142*H113*$B$6/1000)*$H$5/$H$4,0)","v":0.24691490047346931},{"$f":"IF(I113>0,(Eingaben!L142*I113*$B$6/1000)*$I$5/$I$4,0)","v":0}]
["KW Schnitt  > ",null,null,{"$f":"SUM(D115:D129)/15","v":0.32471654803840017},{"$f":"SUM(E115:E129)/15","v":0.21741167767497596},0.28341951255275266,0.19792120452834169,0.80780151116843546,0.43375978956458072]
["KWH gesamt bei Azimut -70 bis +70 > ",null,null,{"$f":"IF(D130>0,D130*$B$17,0)","v":2.7600906583264013},1.8479992602372957,2.4090658566983976,1.6823302384909045,6.8663128449317012,3.6869582112989363]
["Puffervolumen (L) > ",{"$f":"B45","v":1500},"Erwärmung (K)>",{"$f":"IF(D131>0,D131/(($B$45/1000)*1*1.163),0)","v":1.5821671873467478},{"$f":"IF(E131>0,E131/(($B$45/1000)*1*1.163),0)","v":1.0593288966679826},1.3809491869867569,0.96436241816618207,3.9359775551342513,2.1134756155339276]

{"sheet":"Winter","index":2,"n_rows":132,"n_cols":9,"rows_kept":132,"cut":false,"hidden":false,"merged":[[127,0,127,1],[128,0,128,1],[129,0,129,2],[130,0,130,2],[122,0,122,1],[123,0,123,1],[124,0,124,1],[125,0,125,1],[126,0,126,1],[117,0,117,1],[118,0,118,1],[119,0,119,1],[120,0,120,1],[121,0,121,1],[103,2,103,6],[113,0,113,1],[114,0,114,1],[115,0,115,1],[116,0,116,1],[108,0,108,2],[109,0,109,2],[110,0,110,2],[111,0,111,2],[112,0,112,2],[101,0,101,2],[104,0,104,2],[105,0,105,2],[106,0,106,2],[107,0,107,2],[96,0,96,1],[97,0,97,1],[98,0,98,1],[99,0,99,1],[100,0,100,2],[91,0,91,1],[92,0,92,1],[93,0,93,1],[94,0,94,1],[95,0,95,1],[86,0,86,1],[87,0,87,1],[88,0,88,1],[89,0,89,1],[90,0,90,1],[82,0,82,2],[83,0,83,2],[74,2,74,6],[84,0,84,1],[85,0,85,1],[77,0,77,2],[78,0,78,2],[79,0,79,2],[80,0,80,2],[81,0,81,2],[70,0,70,1],[71,0,71,2],[72,0,72,2],[75,0,75,2],[76,0,76,2],[65,0,65,1],[66,0,66,1],[67,0,67,1],[68,0,68,1],[69,0,69,1],[60,0,60,1],[61,0,61,1],[62,0,62,1],[63,0,63,1],[64,0,64,1],[55,0,55,1],[56,0,56,1],[57,0,57,1],[58,0,58,1],[59,0,59,1],[51,0,51,2],[52,0,52,2],[53,0,53,2],[54,0,54,2],[45,2,45,6],[46,0,46,2],[47,0,47,2],[48,0,48,2],[49,0,49,2],[50,0,50,2],[26,0,26,1],[34,0,34,1],[35,0,35,1],[36,0,36,1],[37,0,37,1],[27,0,27,1],[28,0,28,1],[29,0,29,1],[30,0,30,1],[43,0,43,2],[42,0,42,2],[31,0,31,1],[32,0,32,1],[33,0,33,1],[39,0,39,1],[40,0,40,1],[41,0,41,1],[38,0,38,1],[16,2,16,6],[20,0,20,2],[21,0,21,2],[22,0,22,2],[23,0,23,2],[24,0,24,2],[25,0,25,2],[19,0,19,2],[0,0,0,8],[2,0,3,1],[6,0,6,1],[17,0,17,2],[18,0,18,2]]}
["Solartirol Tool       Winter                 Berechnung eines Tagesverlaufes mit IAM (Beispielort Breitengrad 48,8 Kollektorneigung 50°, Strahlung mit Getsolar ermittelt)"]
[null,null,"Infos > ",{"$f":"Herbstfrühjahr!D2","v":0},{"$f":"Herbstfrühjahr!E2","v":0},{"$f":"Herbstfrühjahr!F2","v":0},{"$f":"Herbstfrühjahr!G2","v":0},{"$f":"Herbstfrühjahr!H2","v":0},{"$f":"Herbstfrühjahr!I2","v":0}]
["allgemeine Eingaben",null,"Kollektor > ",{"$f":"Herbstfrühjahr!D3","v":"SolRose 26"},{"$f":"Herbstfrühjahr!E3","v":"Synergie 210"},{"$f":"Herbstfrühjahr!F3","v":"Sunex AMX 2,85"},{"$f":"Herbstfrühjahr!G3","v":"Sunex 2,0"},{"$f":"Herbstfrühjahr!H3","v":"Star Azzurro CPC"},{"$f":"Herbstfrühjahr!I3","v":"Billig VRK"}]
[null,null,"Bruttofl.(m²)",{"$f":"Herbstfrühjahr!D4","v":2.6},{"$f":"Herbstfrühjahr!E4","v":2.0699999999999998},{"$f":"Herbstfrühjahr!F4","v":2.87},{"$f":"Herbstfrühjahr!G4","v":2.0299999999999998},{"$f":"Herbstfrühjahr!H4","v":3.92},{"$f":"Herbstfrühjahr!I4","v":4.18}]
["Berechnung zu Diff.",{"$f":"Eingaben!B3","v":28},"Aperturfl. (m²)",{"$f":"Herbstfrühjahr!D5","v":2.4700000000000002},{"$f":"Herbstfrühjahr!E5","v":1.92},{"$f":"Herbstfrühjahr!F5","v":2.67},{"$f":"Herbstfrühjahr!G5","v":1.84},{"$f":"Herbstfrühjahr!H5","v":3.47},{"$f":"Herbstfrühjahr!I5","v":2.84}]
[" Gesamtfläche (m²)",{"$f":"Eingaben!B6","v":10.46},"η0",{"$f":"Herbstfrühjahr!D6","v":0.81},{"$f":"Herbstfrühjahr!E6","v":0.78500000000000003},{"$f":"Herbstfrühjahr!F6","v":0.82},{"$f":"Herbstfrühjahr!G6","v":0.8},{"$f":"Herbstfrühjahr!H6","v":0.64},{"$f":"Herbstfrühjahr!I6","v":0.65400000000000003}]
["Strahlungseingaben zu Datum",null,"a1",{"$f":"Herbstfrühjahr!D7","v":3.36},{"$f":"Herbstfrühjahr!E7","v":3.722},{"$f":"Herbstfrühjahr!F7","v":3.29},{"$f":"Herbstfrühjahr!G7","v":4.16},{"$f":"Herbstfrühjahr!H7","v":0.749},{"$f":"Herbstfrühjahr!I7","v":1.82}]
["GBS zu Datum (W/m²)",{"$f":"Eingaben!L9","v":"2013-12-21"},"a2",{"$f":"Herbstfrühjahr!D8","v":1.41E-2},{"$f":"Herbstfrühjahr!E8","v":1.2E-2},{"$f":"Herbstfrühjahr!F8","v":2.3E-2},{"$f":"Herbstfrühjahr!G8","v":4.0000000000000001E-3},{"$f":"Herbstfrühjahr!H8","v":5.0000000000000001E-3},{"$f":"Herbstfrühjahr!I8","v":6.6E-3}]
["Strahlung   0°",{"$f":"Eingaben!L10","v":600.4},"IAM 0°",{"$f":"Herbstfrühjahr!D9","v":1},{"$f":"Herbstfrühjahr!E9","v":1},{"$f":"Herbstfrühjahr!F9","v":1},{"$f":"Herbstfrühjahr!G9","v":1},{"$f":"Herbstfrühjahr!H9","v":1},{"$f":"Herbstfrühjahr!I9","v":1}]
["Strahlung 10°",{"$f":"Eingaben!L11","v":585.20000000000005},"IAM 10°",{"$f":"Herbstfrühjahr!D10","v":1},{"$f":"Herbstfrühjahr!E10","v":1},{"$f":"Herbstfrühjahr!F10","v":1},{"$f":"Herbstfrühjahr!G10","v":1},{"$f":"Herbstfrühjahr!H10","v":1.01},{"$f":"Herbstfrühjahr!I10","v":1}]
["Strahlung 20°",{"$f":"Eingaben!L12","v":505.40000000000003},"IAM 20°",{"$f":"Herbstfrühjahr!D11","v":1},{"$f":"Herbstfrühjahr!E11","v":0.99},{"$f":"Herbstfrühjahr!F11","v":0.99},{"$f":"Herbstfrühjahr!G11","v":0.99},{"$f":"Herbstfrühjahr!H11","v":1.01},{"$f":"Herbstfrühjahr!I11","v":1.04}]
["Strahlung 30°",{"$f":"Eingaben!L13","v":401.85},"IAM 30°",{"$f":"Herbstfrühjahr!D12","v":0.99},{"$f":"Herbstfrühjahr!E12","v":0.98},{"$f":"Herbstfrühjahr!F12","v":0.98},{"$f":"Herbstfrühjahr!G12","v":0.98},{"$f":"Herbstfrühjahr!H12","v":1.02},{"$f":"Herbstfrühjahr!I12","v":1.1499999999999999}]
["Strahlung 40°",{"$f":"Eingaben!L14","v":241.3},"IAM 40°",{"$f":"Herbstfrühjahr!D13","v":0.96},{"$f":"Herbstfrühjahr!E13","v":0.97},{"$f":"Herbstfrühjahr!F13","v":0.97},{"$f":"Herbstfrühjahr!G13","v":0.97},{"$f":"Herbstfrühjahr!H13","v":1.02},{"$f":"Herbstfrühjahr!I13","v":1.3}]
["Strahlung 50°",{"$f":"Eingaben!L15","v":91.2},"IAM 50°",{"$f":"Herbstfrühjahr!D14","v":0.94},{"$f":"Herbstfrühjahr!E14","v":0.94},{"$f":"Herbstfrühjahr!F14","v":0.94},{"$f":"Herbstfrühjahr!G14","v":0.95},{"$f":"Herbstfrühjahr!H14","v":0.98},{"$f":"Herbstfrühjahr!I14","v":1.36}]
["Strahlung 60°",{"$f":"Eingaben!L16","v":0},"IAM 60°",{"$f":"Herbstfrühjahr!D15","v":0.86},{"$f":"Herbstfrühjahr!E15","v":0.9},{"$f":"Herbstfrühjahr!F15","v":0.9},{"$f":"Herbstfrühjahr!G15","v":0.9},{"$f":"Herbstfrühjahr!H15","v":1.05},{"$f":"Herbstfrühjahr!I15","v":1.34}]
["Strahlung 70°",{"$f":"Eingaben!L17","v":0},"IAM 70°",{"$f":"Herbstfrühjahr!D16","v":0.73},{"$f":"Herbstfrühjahr!E16","v":0.8},{"$f":"Herbstfrühjahr!F16","v":0.81},{"$f":"Herbstfrühjahr!G16","v":0.81},{"$f":"Herbstfrühjahr!H16","v":1.1399999999999999},{"$f":"Herbstfrühjahr!I16","v":1.1100000000000001}]
["Laufzeit gesamt (Std.) > ",{"$f":"Eingaben!L18","v":7.5},{"$f":"\"Berechnung nach Tagesverlauf mit Sonne (mit IAM) mit Diff. \"&B5&\"  bei  \"&B6&\" m²\"&\"  am \"","v":"Berechnung nach Tagesverlauf mit Sonne (mit IAM) mit Diff. 28  bei  10,46 m²  am "},{"$f":"\"Berechnung nach Tagesverlauf (mit IAM) mit Diff. \"&B5&\"  bei  \"&B6&\" m²\"&\"  am \"","v":"Berechnung nach Tagesverlauf (mit IAM) mit Diff. 28  bei  10,46 m²  am "},null,null,null,{"$f":"B8","v":"2013-12-21"}]
["Tageswirkungsgrad bei Sonne (%) > ",null,null,{"$f":"IF(D44>0,D44/(Eingaben!$M$2/100),\"\")","v":52.238637237371492},{"$f":"IF(E44>0,E44/(Eingaben!$M$2/100),\"\")","v":46.971533780906185},{"$f":"IF(F44>0,F44/(Eingaben!$M$2/100),\"\")","v":50.872239285261351},{"$f":"IF(G44>0,G44/(Eingaben!$M$2/100),\"\")","v":46.054906501528919},{"$f":"IF(H44>0,H44/(Eingaben!$M$2/100),\"\")","v":51.493961127353799},{"$f":"IF(I44>0,I44/(Eingaben!$M$2/100),\"\")","v":36.921473434748833}]
["Wirkungsgrad bei eingestellter Diff. bei   0° >",null,null,{"$f":"IF($B$9>0,($D$6-$D$7*($B$5/$B$9)-$D$8*$B$9*(($B$5/$B$9*$B$5/$B$9)))*$D$9,0)","v":0.63489273817455039},{"$f":"IF($B$9>0,($E$6-$E$7*($B$5/$B$9)-$E$8*$B$9*(($B$5/$B$9*$B$5/$B$9)))*$E$9,0)","v":0.5957528314457029},{"$f":"IF($B$9>0,($F$6-$F$7*($B$5/$B$9)-$F$8*$B$9*(($B$5/$B$9*$B$5/$B$9)))*$F$9,0)","v":0.63653564290473019},{"$f":"IF($B$9>0,($G$6-$G$7*($B$5/$B$9)-$G$8*$B$9*(($B$5/$B$9*$B$5/$B$9)))*$G$9,0)","v":0.60077281812125249},{"$f":"IF($B$9>0,($H$6-$H$7*($B$5/$B$9)-$H$8*$B$9*(($B$5/$B$9*$B$5/$B$9)))*$H$9,0)","v":0.59854097268487672},{"$f":"IF($B$9>0,($I$6-$I$7*($B$5/$B$9)-$I$8*$B$9*(($B$5/$B$9*$B$5/$B$9)))*$I$9,0)","v":0.56050499666888742}]
["Wirkungsgrad bei eingestellter Diff. bei 10° >",null,null,{"$f":"IF($B$10>0,($D$6-$D$7*($B$5/$B$10)-$D$8*$B$10*(($B$5/$B$10*$B$5/$B$10)))*$D$10,0)","v":0.63034449760765554},{"$f":"IF($B$10>0,($E$6-$E$7*($B$5/$B$10)-$E$8*$B$10*(($B$5/$B$10*$B$5/$B$10)))*$E$10,0)","v":0.59083732057416272},{"$f":"IF($B$10>0,($F$6-$F$7*($B$5/$B$10)-$F$8*$B$10*(($B$5/$B$10*$B$5/$B$10)))*$F$10,0)","v":0.63177033492822965},{"$f":"IF($B$10>0,($G$6-$G$7*($B$5/$B$10)-$G$8*$B$10*(($B$5/$B$10*$B$5/$B$10)))*$G$10,0)","v":0.59559808612440202},{"$f":"IF($B$10>0,($H$6-$H$7*($B$5/$B$10)-$H$8*$B$10*(($B$5/$B$10*$B$5/$B$10)))*$H$10,0)","v":0.60343875598086127},{"$f":"IF($B$10>0,($I$6-$I$7*($B$5/$B$10)-$I$8*$B$10*(($B$5/$B$10*$B$5/$B$10)))*$I$10,0)","v":0.5580765550239235}]
["Wirkungsgrad bei eingestellter Diff. bei 20° >",null,null,{"$f":"IF($B$11>0,($D$6-$D$7*($B$5/$B$11)-$D$8*$B$11*(($B$5/$B$11*$B$5/$B$11)))*$D$11,0)","v":0.60197783933518012},{"$f":"IF($B$11>0,($E$6-$E$7*($B$5/$B$11)-$E$8*$B$11*(($B$5/$B$11*$B$5/$B$11)))*$E$11,0)","v":0.55457825484764545},{"$f":"IF($B$11>0,($F$6-$F$7*($B$5/$B$11)-$F$8*$B$11*(($B$5/$B$11*$B$5/$B$11)))*$F$11,0)","v":0.59602936288088626},{"$f":"IF($B$11>0,($G$6-$G$7*($B$5/$B$11)-$G$8*$B$11*(($B$5/$B$11*$B$5/$B$11)))*$G$11,0)","v":0.55769085872576174},{"$f":"IF($B$11>0,($H$6-$H$7*($B$5/$B$11)-$H$8*$B$11*(($B$5/$B$11*$B$5/$B$11)))*$H$11,0)","v":0.59665540166204989},{"$f":"IF($B$11>0,($I$6-$I$7*($B$5/$B$11)-$I$8*$B$11*(($B$5/$B$11*$B$5/$B$11)))*$I$11,0)","v":0.56464797783933518}]
["Wirkungsgrad bei eingestellter Diff. bei 30° >",null,null,{"$f":"IF($B$12>0,($D$6-$D$7*($B$5/$B$12)-$D$8*$B$12*(($B$5/$B$12*$B$5/$B$12)))*$D$12,0)","v":0.54289027995520722},{"$f":"IF($B$12>0,($E$6-$E$7*($B$5/$B$12)-$E$8*$B$12*(($B$5/$B$12*$B$5/$B$12)))*$E$12,0)","v":0.49220277466716444},{"$f":"IF($B$12>0,($F$6-$F$7*($B$5/$B$12)-$F$8*$B$12*(($B$5/$B$12*$B$5/$B$12)))*$F$12,0)","v":0.53497001368669894},{"$f":"IF($B$12>0,($G$6-$G$7*($B$5/$B$12)-$G$8*$B$12*(($B$5/$B$12*$B$5/$B$12)))*$G$12,0)","v":0.49228995893990296},{"$f":"IF($B$12>0,($H$6-$H$7*($B$5/$B$12)-$H$8*$B$12*(($B$5/$B$12*$B$5/$B$12)))*$H$12,0)","v":0.58961761851437111},{"$f":"IF($B$12>0,($I$6-$I$7*($B$5/$B$12)-$I$8*$B$12*(($B$5/$B$12*$B$5/$B$12)))*$I$12,0)","v":0.59145657583675504}]
["Wirkungsgrad bei eingestellter Diff. bei 40° >",null,null,{"$f":"IF($B$13>0,($D$6-$D$7*($B$5/$B$13)-$D$8*$B$13*(($B$5/$B$13*$B$5/$B$13)))*$D$13,0)","v":0.35932803978450073},{"$f":"IF($B$13>0,($E$6-$E$7*($B$5/$B$13)-$E$8*$B$13*(($B$5/$B$13*$B$5/$B$13)))*$E$13,0)","v":0.30469376295068384},{"$f":"IF($B$13>0,($F$6-$F$7*($B$5/$B$13)-$F$8*$B$13*(($B$5/$B$13*$B$5/$B$13)))*$F$13,0)","v":0.35260082884376293},{"$f":"IF($B$13>0,($G$6-$G$7*($B$5/$B$13)-$G$8*$B$13*(($B$5/$B$13*$B$5/$B$13)))*$G$13,0)","v":0.29515656858682149},{"$f":"IF($B$13>0,($H$6-$H$7*($B$5/$B$13)-$H$8*$B$13*(($B$5/$B$13*$B$5/$B$13)))*$H$13,0)","v":0.54757894736842105},{"$f":"IF($B$13>0,($I$6-$I$7*($B$5/$B$13)-$I$8*$B$13*(($B$5/$B$13*$B$5/$B$13)))*$I$13,0)","v":0.54777679237463739}]
["Wirkungsgrad bei eingestellter Diff. bei 50° >",null,null,{"$f":"IF($B$14>0,($D$6-$D$7*($B$5/$B$14)-$D$8*$B$14*(($B$5/$B$14*$B$5/$B$14)))*$D$14,0)","v":-0.32222210526315792},{"$f":"IF($B$14>0,($E$6-$E$7*($B$5/$B$14)-$E$8*$B$14*(($B$5/$B$14*$B$5/$B$14)))*$E$14,0)","v":-0.43322456140350873},{"$f":"IF($B$14>0,($F$6-$F$7*($B$5/$B$14)-$F$8*$B$14*(($B$5/$B$14*$B$5/$B$14)))*$F$14,0)","v":-0.36453859649122811},{"$f":"IF($B$14>0,($G$6-$G$7*($B$5/$B$14)-$G$8*$B$14*(($B$5/$B$14*$B$5/$B$14)))*$G$14,0)","v":-0.48600000000000015},{"$f":"IF($B$14>0,($H$6-$H$7*($B$5/$B$14)-$H$8*$B$14*(($B$5/$B$14*$B$5/$B$14)))*$H$14,0)","v":0.35972017543859647},{"$f":"IF($B$14>0,($I$6-$I$7*($B$5/$B$14)-$I$8*$B$14*(($B$5/$B$14*$B$5/$B$14)))*$I$14,0)","v":5.2348070175438535E-2}]
["Wirkungsgrad bei eingestellter Diff. bei 60° >",null,null,{"$f":"IF($B$15>0,($D$6-$D$7*($B$5/$B$15)-$D$8*$B$15*(($B$5/$B$15*$B$5/$B$15)))*$D$15,0)","v":0},{"$f":"IF($B$15>0,($E$6-$E$7*($B$5/$B$15)-$E$8*$B$15*(($B$5/$B$15*$B$5/$B$15)))*$E$15,0)","v":0},{"$f":"IF($B$15>0,($F$6-$F$7*($B$5/$B$15)-$F$8*$B$15*(($B$5/$B$15*$B$5/$B$15)))*$F$15,0)","v":0},{"$f":"IF($B$15>0,($G$6-$G$7*($B$5/$B$15)-$G$8*$B$15*(($B$5/$B$15*$B$5/$B$15)))*$G$15,0)","v":0},{"$f":"IF($B$15>0,($H$6-$H$7*($B$5/$B$15)-$H$8*$B$15*(($B$5/$B$15*$B$5/$B$15)))*$H$15,0)","v":0},{"$f":"IF($B$15>0,($I$6-$I$7*($B$5/$B$15)-$I$8*$B$15*(($B$5/$B$15*$B$5/$B$15)))*$I$15,0)","v":0}]
["Wirkungsgrad bei eingestellter Diff. bei 70° >",null,null,{"$f":"IF($B$16>0,($D$6-$D$7*($B$5/$B$16)-$D$8*$B$16*(($B$5/$B$16*$B$5/$B$16)))*$D$16,0)","v":0},{"$f":"IF($B$16>0,($E$6-$E$7*($B$5/$B$16)-$E$8*$B$16*(($B$5/$B$16*$B$5/$B$16)))*$E$16,0)","v":0},{"$f":"IF($B$16>0,($F$6-$F$7*($B$5/$B$16)-$F$8*$B$16*(($B$5/$B$16*$B$5/$B$16)))*$F$16,0)","v":0},{"$f":"IF($B$16>0,($G$6-$G$7*($B$5/$B$16)-$G$8*$B$16*(($B$5/$B$16*$B$5/$B$16)))*$G$16,0)","v":0},{"$f":"IF($B$16>0,($H$6-$H$7*($B$5/$B$16)-$H$8*$B$16*(($B$5/$B$16*$B$5/$B$16)))*$H$16,0)","v":0},{"$f":"IF($B$16>0,($I$6-$I$7*($B$5/$B$16)-$I$8*$B$16*(($B$5/$B$16*$B$5/$B$16)))*$I$16,0)","v":0}]
["Leistung nach Tagesverlauf  ",null,"Azimut",{"$f":"IF(D3>0,D3,\"\")","v":"SolRose 26"},{"$f":"IF(E3>0,E3,\"\")","v":"Synergie 210"},"Sunex AMX 2,85","Sunex 2,0","Star Azzurro CPC","Billig VRK"]
["Leistung bei eingetragener Fläche (KW)",null,-70,{"$f":"IF(D26>0,($B$16*D26*$B$6/1000)*$D$5/$D$4,0)","v":0},{"$f":"IF(E26>0,($B$16*E26*$B$6/1000)*$E$5/$E$4,0)","v":0},{"$f":"IF(F26>0,($B$16*F26*$B$6/1000)*$F$5/$F$4,0)","v":0},{"$f":"IF(G26>0,($B$16*G26*$B$6/1000)*$G$5/$G$4,0)","v":0},{"$f":"IF(H26>0,($B$16*H26*$B$6/1000)*$H$5/$H$4,0)","v":0},{"$f":"IF(I26>0,($B$16*I26*$B$6/1000)*$I$5/$I$4,0)","v":0}]
["Leistung bei eingetragener Fläche (KW)",null,-60,{"$f":"IF(D25>0,($B$15*D25*$B$6/1000)*$D$5/$D$4,0)","v":0},{"$f":"IF(E25>0,($B$15*E25*$B$6/1000)*$E$5/$E$4,0)","v":0},{"$f":"IF(F25>0,($B$15*F25*$B$6/1000)*$F$5/$F$4,0)","v":0},{"$f":"IF(G25>0,($B$15*G25*$B$6/1000)*$G$5/$G$4,0)","v":0},{"$f":"IF(H25>0,($B$15*H25*$B$6/1000)*$H$5/$H$4,0)","v":0},{"$f":"IF(I25>0,($B$15*I25*$B$6/1000)*$I$5/$I$4,0)","v":0}]
["Leistung bei eingetragener Fläche (KW)",null,-50,{"$f":"IF(D24>0,($B$14*D24*$B$6/1000)*$D$5/$D$4,0)","v":0},{"$f":"IF(E24>0,($B$14*E24*$B$6/1000)*$E$5/$E$4,0)","v":0},{"$f":"IF(F24>0,($B$14*F24*$B$6/1000)*$F$5/$F$4,0)","v":0},{"$f":"IF(G24>0,($B$14*G24*$B$6/1000)*$G$5/$G$4,0)","v":0},{"$f":"IF(H24>0,($B$14*H24*$B$6/1000)*$H$5/$H$4,0)","v":0.30376289780000004},{"$f":"IF(I24>0,($B$14*I24*$B$6/1000)*$I$5/$I$4,0)","v":3.392885916784686E-2}]
["Leistung bei eingetragener Fläche (KW)",null,-40,{"$f":"IF(D23>0,($B$13*D23*$B$6/1000)*$D$5/$D$4,0)","v":0.86159609107200041},{"$f":"IF(E23>0,($B$13*E23*$B$6/1000)*$E$5/$E$4,0)","v":0.71331844480000017},{"$f":"IF(F23>0,($B$13*F23*$B$6/1000)*$F$5/$F$4,0)","v":0.82794540444459919},{"$f":"IF(G23>0,($B$13*G23*$B$6/1000)*$G$5/$G$4,0)","v":0.67524790314876881},{"$f":"IF(H23>0,($B$13*H23*$B$6/1000)*$H$5/$H$4,0)","v":1.2234300874897959},{"$f":"IF(I23>0,($B$13*I23*$B$6/1000)*$I$5/$I$4,0)","v":0.93936568915215335}]
["Leistung bei eingetragener Fläche (KW)",null,-30,{"$f":"IF(D22>0,($B$12*D22*$B$6/1000)*$D$5/$D$4,0)","v":2.1678604810830007},{"$f":"IF(E22>0,($B$12*E22*$B$6/1000)*$E$5/$E$4,0)","v":1.9189806609623197},{"$f":"IF(F22>0,($B$12*F22*$B$6/1000)*$F$5/$F$4,0)","v":2.0919652268780484},{"$f":"IF(G22>0,($B$12*G22*$B$6/1000)*$G$5/$G$4,0)","v":1.8755922087724142},{"$f":"IF(H22>0,($B$12*H22*$B$6/1000)*$H$5/$H$4,0)","v":2.1938630684204092},{"$f":"IF(I22>0,($B$12*I22*$B$6/1000)*$I$5/$I$4,0)","v":1.6891202952583737}]
["Leistung bei eingetragener Fläche (KW)",null,-20,{"$f":"IF(D21>0,($B$11*D21*$B$6/1000)*$D$5/$D$4,0)","v":3.0232289052000008},{"$f":"IF(E21>0,($B$11*E21*$B$6/1000)*$E$5/$E$4,0)","v":2.7193220368695661},{"$f":"IF(F21>0,($B$11*F21*$B$6/1000)*$F$5/$F$4,0)","v":2.9313247990829261},{"$f":"IF(G21>0,($B$11*G21*$B$6/1000)*$G$5/$G$4,0)","v":2.672281672386208},{"$f":"IF(H21>0,($B$11*H21*$B$6/1000)*$H$5/$H$4,0)","v":2.792118888614286},{"$f":"IF(I21>0,($B$11*I21*$B$6/1000)*$I$5/$I$4,0)","v":2.0280878232926312}]
["Leistung bei eingetragener Fläche (KW)",null,-10,{"$f":"IF(D20>0,($B$10*D20*$B$6/1000)*$D$5/$D$4,0)","v":3.6655367112000006},{"$f":"IF(E20>0,($B$10*E20*$B$6/1000)*$E$5/$E$4,0)","v":3.3545541379710153},{"$f":"IF(F20>0,($B$10*F20*$B$6/1000)*$F$5/$F$4,0)","v":3.5976971004878053},{"$f":"IF(G20>0,($B$10*G20*$B$6/1000)*$G$5/$G$4,0)","v":3.3045405131034498},{"$f":"IF(H20>0,($B$10*H20*$B$6/1000)*$H$5/$H$4,0)","v":3.2697353992428582},{"$f":"IF(I20>0,($B$10*I20*$B$6/1000)*$I$5/$I$4,0)","v":2.3209823523827762}]
["Leistung bei eingetragener Fläche (KW)",null,0,{"$f":"IF(D19>0,($B$9*D19*$B$6/1000)*$D$5/$D$4,0)","v":3.7878810552000011},{"$f":"IF(E19>0,($B$9*E19*$B$6/1000)*$E$5/$E$4,0)","v":3.4703187478260871},{"$f":"IF(F19>0,($B$9*F19*$B$6/1000)*$F$5/$F$4,0)","v":3.7189852833449479},{"$f":"IF(G19>0,($B$9*G19*$B$6/1000)*$G$5/$G$4,0)","v":3.4198292933990158},{"$f":"IF(H19>0,($B$9*H19*$B$6/1000)*$H$5/$H$4,0)","v":3.3274356165306127},{"$f":"IF(I19>0,($B$9*I19*$B$6/1000)*$I$5/$I$4,0)","v":2.3916295727464116}]
["Leistung bei eingetragener Fläche (KW)",null,10,{"$f":"IF(D20>0,($B$10*D20*$B$6/1000)*$D$5/$D$4,0)","v":3.6655367112000006},{"$f":"IF(E20>0,($B$10*E20*$B$6/1000)*$E$5/$E$4,0)","v":3.3545541379710153},{"$f":"IF(F20>0,($B$10*F20*$B$6/1000)*$F$5/$F$4,0)","v":3.5976971004878053},{"$f":"IF(G20>0,($B$10*G20*$B$6/1000)*$G$5/$G$4,0)","v":3.3045405131034498},{"$f":"IF(H20>0,($B$10*H20*$B$6/1000)*$H$5/$H$4,0)","v":3.2697353992428582},{"$f":"IF(I20>0,($B$10*I20*$B$6/1000)*$I$5/$I$4,0)","v":2.3209823523827762}]
["Leistung bei eingetragener Fläche (KW)",null,20,{"$f":"IF(D21>0,($B$11*D21*$B$6/1000)*$D$5/$D$4,0)","v":3.0232289052000008},{"$f":"IF(E21>0,($B$11*E21*$B$6/1000)*$E$5/$E$4,0)","v":2.7193220368695661},{"$f":"IF(F21>0,($B$11*F21*$B$6/1000)*$F$5/$F$4,0)","v":2.9313247990829261},{"$f":"IF(G21>0,($B$11*G21*$B$6/1000)*$G$5/$G$4,0)","v":2.672281672386208},{"$f":"IF(H21>0,($B$11*H21*$B$6/1000)*$H$5/$H$4,0)","v":2.792118888614286},{"$f":"IF(I21>0,($B$11*I21*$B$6/1000)*$I$5/$I$4,0)","v":2.0280878232926312}]
["Leistung bei eingetragener Fläche (KW)",null,30,{"$f":"IF(D22>0,($B$12*D22*$B$6/1000)*$D$5/$D$4,0)","v":2.1678604810830007},{"$f":"IF(E22>0,($B$12*E22*$B$6/1000)*$E$5/$E$4,0)","v":1.9189806609623197},{"$f":"IF(F22>0,($B$12*F22*$B$6/1000)*$F$5/$F$4,0)","v":2.0919652268780484},{"$f":"IF(G22>0,($B$12*G22*$B$6/1000)*$G$5/$G$4,0)","v":1.8755922087724142},{"$f":"IF(H22>0,($B$12*H22*$B$6/1000)*$H$5/$H$4,0)","v":2.1938630684204092},{"$f":"IF(I22>0,($B$12*I22*$B$6/1000)*$I$5/$I$4,0)","v":1.6891202952583737}]
["Leistung bei eingetragener Fläche (KW)",null,40,{"$f":"IF(D23>0,($B$13*D23*$B$6/1000)*$D$5/$D$4,0)","v":0.86159609107200041},{"$f":"IF(E23>0,($B$13*E23*$B$6/1000)*$E$5/$E$4,0)","v":0.71331844480000017},{"$f":"IF(F23>0,($B$13*F23*$B$6/1000)*$F$5/$F$4,0)","v":0.82794540444459919},{"$f":"IF(G23>0,($B$13*G23*$B$6/1000)*$G$5/$G$4,0)","v":0.67524790314876881},{"$f":"IF(H23>0,($B$13*H23*$B$6/1000)*$H$5/$H$4,0)","v":1.2234300874897959},{"$f":"IF(I23>0,($B$13*I23*$B$6/1000)*$I$5/$I$4,0)","v":0.93936568915215335}]
["Leistung bei eingetragener Fläche (KW)",null,50,{"$f":"IF(D24>0,($B$14*D24*$B$6/1000)*$D$5/$D$4,0)","v":0},{"$f":"IF(E24>0,($B$14*E24*$B$6/1000)*$E$5/$E$4,0)","v":0},{"$f":"IF(F24>0,($B$14*F24*$B$6/1000)*$F$5/$F$4,0)","v":0},{"$f":"IF(G24>0,($B$14*G24*$B$6/1000)*$G$5/$G$4,0)","v":0},{"$f":"IF(H24>0,($B$14*H24*$B$6/1000)*$H$5/$H$4,0)","v":0.30376289780000004},{"$f":"IF(I24>0,($B$14*I24*$B$6/1000)*$I$5/$I$4,0)","v":3.392885916784686E-2}]
["Leistung bei eingetragener Fläche (KW)",null,60,{"$f":"IF(D25>0,($B$15*D25*$B$6/1000)*$D$5/$D$4,0)","v":0},{"$f":"IF(E25>0,($B$15*E25*$B$6/1000)*$E$5/$E$4,0)","v":0},{"$f":"IF(F25>0,($B$15*F25*$B$6/1000)*$F$5/$F$4,0)","v":0},{"$f":"IF(G25>0,($B$15*G25*$B$6/1000)*$G$5/$G$4,0)","v":0},{"$f":"IF(H25>0,($B$15*H25*$B$6/1000)*$H$5/$H$4,0)","v":0},{"$f":"IF(I25>0,($B$15*I25*$B$6/1000)*$I$5/$I$4,0)","v":0}]
["Leistung bei eingetragener Fläche (KW)",null,70,{"$f":"IF(D26>0,($B$16*D26*$B$6/1000)*$D$5/$D$4,0)","v":0},{"$f":"IF(E26>0,($B$16*E26*$B$6/1000)*$E$5/$E$4,0)","v":0},{"$f":"IF(F26>0,($B$16*F26*$B$6/1000)*$F$5/$F$4,0)","v":0},{"$f":"IF(G26>0,($B$16*G26*$B$6/1000)*$G$5/$G$4,0)","v":0},{"$f":"IF(H26>0,($B$16*H26*$B$6/1000)*$H$5/$H$4,0)","v":0},{"$f":"IF(I26>0,($B$16*I26*$B$6/1000)*$I$5/$I$4,0)","v":0}]
["KW Schnitt  > ",null,null,{"$f":"SUM(D28:D42)/15","v":1.5482883621540005},{"$f":"SUM(E28:E42)/15","v":1.3921779539354593},1.5077900230087804,1.3650102592147133,1.5262170866443541,1.0943066407502651]
["KWH gesamt bei Azimut -70 bis +70 > ",null,null,{"$f":"IF(D43>0,D43*$B$17,0)","v":11.612162716155003},10.441334654515945,11.308425172565853,10.23757694411035,11.446628149832655,8.2072998056269881]
["Puffervolumen (L) > ",{"$f":"Eingaben!B7","v":1500},"Erwärmung (K)>",{"$f":"IF(D44>0,D44/(($B$45/1000)*1*1.163),0)","v":6.6564417977386094},{"$f":"IF(E44>0,E44/(($B$45/1000)*1*1.163),0)","v":5.9852878501094553},6.4823302794874484,5.8684877868216399,6.5615523931399578,4.7046717143175627]
["Laufzeit gesamt (Std.) > ",{"$f":"B17","v":7.5},{"$f":"\"Berechnung nach Tagesverlauf bei leichter Bewölkung (mit IAM) mit Diff. \"&B5&\"  bei  \"&B6&\" m²\"&\"  am \"","v":"Berechnung nach Tagesverlauf bei leichter Bewölkung (mit IAM) mit Diff. 28  bei  10,46 m²  am "},null,null,null,null,{"$f":"H17","v":"2013-12-21"}]
["Wirkungsgrad bei  Diff.0  > ",null,null,{"$f":"$D$6-$D$7*(0/1000)-$D$8*1000*((0/1000*0/1000))","v":0.81},{"$f":"$E$6-$E$7*(0/1000)-$E$8*1000*((0/1000*0/1000))","v":0.78500000000000003},{"$f":"$F$6-$F$7*(0/1000)-$F$8*1000*((0/1000*0/1000))","v":0.82},{"$f":"$G$6-$G$7*(0/1000)-$G$8*1000*((0/1000*0/1000))","v":0.8},{"$f":"$H$6-$H$7*(0/1000)-$H$8*1000*((0/1000*0/1000))","v":0.64},{"$f":"$I$6-$I$7*(0/1000)-$I$8*1000*((0/1000*0/1000))","v":0.65400000000000003}]
["Wirkungsgrad bei eingestellter Diff. bei   0° >",null,null,{"$f":"IF(Eingaben!L46>0,($D$6-$D$7*($B$5/Eingaben!L46)-$D$8*Eingaben!L46*(($B$5/Eingaben!L46*$B$5/Eingaben!L46)))*$D$9,0)","v":0.57652365089940039},{"$f":"IF(Eingaben!L46>0,($E$6-$E$7*($B$5/Eingaben!L46)-$E$8*Eingaben!L46*(($B$5/Eingaben!L46*$B$5/Eingaben!L46)))*$E$9,0)","v":0.53267044192760382},{"$f":"IF(Eingaben!L46>0,($F$6-$F$7*($B$5/Eingaben!L46)-$F$8*Eingaben!L46*(($B$5/Eingaben!L46*$B$5/Eingaben!L46)))*$F$9,0)","v":0.57538085720630683},{"$f":"IF(Eingaben!L46>0,($G$6-$G$7*($B$5/Eingaben!L46)-$G$8*Eingaben!L46*(($B$5/Eingaben!L46*$B$5/Eingaben!L46)))*$G$9,0)","v":0.53436375749500331},{"$f":"IF(Eingaben!L46>0,($H$6-$H$7*($B$5/Eingaben!L46)-$H$8*Eingaben!L46*(($B$5/Eingaben!L46*$B$5/Eingaben!L46)))*$H$9,0)","v":0.5847212969131691},{"$f":"IF(Eingaben!L46>0,($I$6-$I$7*($B$5/Eingaben!L46)-$I$8*Eingaben!L46*(($B$5/Eingaben!L46*$B$5/Eingaben!L46)))*$I$9,0)","v":0.52933999555851652}]
["Wirkungsgrad bei eingestellter Diff. bei 10° >",null,null,{"$f":"IF(Eingaben!L47>0,($D$6-$D$7*($B$5/Eingaben!L47)-$D$8*Eingaben!L47*(($B$5/Eingaben!L47*$B$5/Eingaben!L47)))*$D$10,0)","v":0.57045933014354078},{"$f":"IF(Eingaben!L47>0,($E$6-$E$7*($B$5/Eingaben!L47)-$E$8*Eingaben!L47*(($B$5/Eingaben!L47*$B$5/Eingaben!L47)))*$E$10,0)","v":0.52611642743221698},{"$f":"IF(Eingaben!L47>0,($F$6-$F$7*($B$5/Eingaben!L47)-$F$8*Eingaben!L47*(($B$5/Eingaben!L47*$B$5/Eingaben!L47)))*$F$10,0)","v":0.56902711323763944},{"$f":"IF(Eingaben!L47>0,($G$6-$G$7*($B$5/Eingaben!L47)-$G$8*Eingaben!L47*(($B$5/Eingaben!L47*$B$5/Eingaben!L47)))*$G$10,0)","v":0.52746411483253586},{"$f":"IF(Eingaben!L47>0,($H$6-$H$7*($B$5/Eingaben!L47)-$H$8*Eingaben!L47*(($B$5/Eingaben!L47*$B$5/Eingaben!L47)))*$H$10,0)","v":0.58911834130781504},{"$f":"IF(Eingaben!L47>0,($I$6-$I$7*($B$5/Eingaben!L47)-$I$8*Eingaben!L47*(($B$5/Eingaben!L47*$B$5/Eingaben!L47)))*$I$10,0)","v":0.52610207336523129}]
["Wirkungsgrad bei eingestellter Diff. bei 20° >",null,null,{"$f":"IF(Eingaben!L48>0,($D$6-$D$7*($B$5/Eingaben!L48)-$D$8*Eingaben!L48*(($B$5/Eingaben!L48*$B$5/Eingaben!L48)))*$D$11,0)","v":0.53263711911357348},{"$f":"IF(Eingaben!L48>0,($E$6-$E$7*($B$5/Eingaben!L48)-$E$8*Eingaben!L48*(($B$5/Eingaben!L48*$B$5/Eingaben!L48)))*$E$11,0)","v":0.48038767313019393},{"$f":"IF(Eingaben!L48>0,($F$6-$F$7*($B$5/Eingaben!L48)-$F$8*Eingaben!L48*(($B$5/Eingaben!L48*$B$5/Eingaben!L48)))*$F$11,0)","v":0.52410581717451521},{"$f":"IF(Eingaben!L48>0,($G$6-$G$7*($B$5/Eingaben!L48)-$G$8*Eingaben!L48*(($B$5/Eingaben!L48*$B$5/Eingaben!L48)))*$G$11,0)","v":0.47958781163434905},{"$f":"IF(Eingaben!L48>0,($H$6-$H$7*($B$5/Eingaben!L48)-$H$8*Eingaben!L48*(($B$5/Eingaben!L48*$B$5/Eingaben!L48)))*$H$11,0)","v":0.58007386888273327},{"$f":"IF(Eingaben!L48>0,($I$6-$I$7*($B$5/Eingaben!L48)-$I$8*Eingaben!L48*(($B$5/Eingaben!L48*$B$5/Eingaben!L48)))*$I$11,0)","v":0.52614397045244699}]
["Wirkungsgrad bei eingestellter Diff. bei 30° >",null,null,{"$f":"IF(Eingaben!L49>0,($D$6-$D$7*($B$5/Eingaben!L49)-$D$8*Eingaben!L49*(($B$5/Eingaben!L49*$B$5/Eingaben!L49)))*$D$12,0)","v":0.456553706606943},{"$f":"IF(Eingaben!L49>0,($E$6-$E$7*($B$5/Eingaben!L49)-$E$8*Eingaben!L49*(($B$5/Eingaben!L49*$B$5/Eingaben!L49)))*$E$12,0)","v":0.39983703288955263},{"$f":"IF(Eingaben!L49>0,($F$6-$F$7*($B$5/Eingaben!L49)-$F$8*Eingaben!L49*(($B$5/Eingaben!L49*$B$5/Eingaben!L49)))*$F$12,0)","v":0.44542668491559873},{"$f":"IF(Eingaben!L49>0,($G$6-$G$7*($B$5/Eingaben!L49)-$G$8*Eingaben!L49*(($B$5/Eingaben!L49*$B$5/Eingaben!L49)))*$G$12,0)","v":0.39505327858653738},{"$f":"IF(Eingaben!L49>0,($H$6-$H$7*($B$5/Eingaben!L49)-$H$8*Eingaben!L49*(($B$5/Eingaben!L49*$B$5/Eingaben!L49)))*$H$12,0)","v":0.56855682468582802},{"$f":"IF(Eingaben!L49>0,($I$6-$I$7*($B$5/Eingaben!L49)-$I$8*Eingaben!L49*(($B$5/Eingaben!L49*$B$5/Eingaben!L49)))*$I$12,0)","v":0.53790876778234009}]
["Wirkungsgrad bei eingestellter Diff. bei 40° >",null,null,{"$f":"IF(Eingaben!L50>0,($D$6-$D$7*($B$5/Eingaben!L50)-$D$8*Eingaben!L50*(($B$5/Eingaben!L50*$B$5/Eingaben!L50)))*$D$13,0)","v":0.21990405304600094},{"$f":"IF(Eingaben!L50>0,($E$6-$E$7*($B$5/Eingaben!L50)-$E$8*Eingaben!L50*(($B$5/Eingaben!L50*$B$5/Eingaben!L50)))*$E$13,0)","v":0.15244168393424515},{"$f":"IF(Eingaben!L50>0,($F$6-$F$7*($B$5/Eingaben!L50)-$F$8*Eingaben!L50*(($B$5/Eingaben!L50*$B$5/Eingaben!L50)))*$F$13,0)","v":0.20500110512501729},{"$f":"IF(Eingaben!L50>0,($G$6-$G$7*($B$5/Eingaben!L50)-$G$8*Eingaben!L50*(($B$5/Eingaben!L50*$B$5/Eingaben!L50)))*$G$13,0)","v":0.13487542478242859},{"$f":"IF(Eingaben!L50>0,($H$6-$H$7*($B$5/Eingaben!L50)-$H$8*Eingaben!L50*(($B$5/Eingaben!L50*$B$5/Eingaben!L50)))*$H$13,0)","v":0.51250526315789469},{"$f":"IF(Eingaben!L50>0,($I$6-$I$7*($B$5/Eingaben!L50)-$I$8*Eingaben!L50*(($B$5/Eingaben!L50*$B$5/Eingaben!L50)))*$I$13,0)","v":0.44696905649951657}]
["Wirkungsgrad bei eingestellter Diff. bei 50° >",null,null,{"$f":"IF(Eingaben!L51>0,($D$6-$D$7*($B$5/Eingaben!L51)-$D$8*Eingaben!L51*(($B$5/Eingaben!L51*$B$5/Eingaben!L51)))*$D$14,0)","v":-0.68342947368421025},{"$f":"IF(Eingaben!L51>0,($E$6-$E$7*($B$5/Eingaben!L51)-$E$8*Eingaben!L51*(($B$5/Eingaben!L51*$B$5/Eingaben!L51)))*$E$14,0)","v":-0.82359941520467816},{"$f":"IF(Eingaben!L51>0,($F$6-$F$7*($B$5/Eingaben!L51)-$F$8*Eingaben!L51*(($B$5/Eingaben!L51*$B$5/Eingaben!L51)))*$F$14,0)","v":-0.74298479532163741},{"$f":"IF(Eingaben!L51>0,($G$6-$G$7*($B$5/Eingaben!L51)-$G$8*Eingaben!L51*(($B$5/Eingaben!L51*$B$5/Eingaben!L51)))*$G$14,0)","v":-0.90133333333333332},{"$f":"IF(Eingaben!L51>0,($H$6-$H$7*($B$5/Eingaben!L51)-$H$8*Eingaben!L51*(($B$5/Eingaben!L51*$B$5/Eingaben!L51)))*$H$14,0)","v":0.27056023391812872},{"$f":"IF(Eingaben!L51>0,($I$6-$I$7*($B$5/Eingaben!L51)-$I$8*Eingaben!L51*(($B$5/Eingaben!L51*$B$5/Eingaben!L51)))*$I$14,0)","v":-0.22668257309941509}]
["Wirkungsgrad bei eingestellter Diff. bei 60° >",null,null,{"$f":"IF(Eingaben!L52>0,($D$6-$D$7*($B$5/Eingaben!L52)-$D$8*Eingaben!L52*(($B$5/Eingaben!L52*$B$5/Eingaben!L52)))*$D$15,0)","v":0},{"$f":"IF(Eingaben!L52>0,($E$6-$E$7*($B$5/Eingaben!L52)-$E$8*Eingaben!L52*(($B$5/Eingaben!L52*$B$5/Eingaben!L52)))*$E$15,0)","v":0},{"$f":"IF(Eingaben!L52>0,($F$6-$F$7*($B$5/Eingaben!L52)-$F$8*Eingaben!L52*(($B$5/Eingaben!L52*$B$5/Eingaben!L52)))*$F$15,0)","v":0},{"$f":"IF(Eingaben!L52>0,($G$6-$G$7*($B$5/Eingaben!L52)-$G$8*Eingaben!L52*(($B$5/Eingaben!L52*$B$5/Eingaben!L52)))*$G$15,0)","v":0},{"$f":"IF(Eingaben!L52>0,($H$6-$H$7*($B$5/Eingaben!L52)-$H$8*Eingaben!L52*(($B$5/Eingaben!L52*$B$5/Eingaben!L52)))*$H$15,0)","v":0},{"$f":"IF(Eingaben!L52>0,($I$6-$I$7*($B$5/Eingaben!L52)-$I$8*Eingaben!L52*(($B$5/Eingaben!L52*$B$5/Eingaben!L52)))*$I$15,0)","v":0}]
["Wirkungsgrad bei eingestellter Diff. bei 70° >",null,null,{"$f":"IF(Eingaben!L53>0,($D$6-$D$7*($B$5/Eingaben!L53)-$D$8*Eingaben!L53*(($B$5/Eingaben!L53*$B$5/Eingaben!L53)))*$D$16,0)","v":0},{"$f":"IF(Eingaben!L53>0,($E$6-$E$7*($B$5/Eingaben!L53)-$E$8*Eingaben!L53*(($B$5/Eingaben!L53*$B$5/Eingaben!L53)))*$E$16,0)","v":0},{"$f":"IF(Eingaben!L53>0,($F$6-$F$7*($B$5/Eingaben!L53)-$F$8*Eingaben!L53*(($B$5/Eingaben!L53*$B$5/Eingaben!L53)))*$F$16,0)","v":0},{"$f":"IF(Eingaben!L53>0,($G$6-$G$7*($B$5/Eingaben!L53)-$G$8*Eingaben!L53*(($B$5/Eingaben!L53*$B$5/Eingaben!L53)))*$G$16,0)","v":0},{"$f":"IF(Eingaben!L53>0,($H$6-$H$7*($B$5/Eingaben!L53)-$H$8*Eingaben!L53*(($B$5/Eingaben!L53*$B$5/Eingaben!L53)))*$H$16,0)","v":0},{"$f":"IF(Eingaben!L53>0,($I$6-$I$7*($B$5/Eingaben!L53)-$I$8*Eingaben!L53*(($B$5/Eingaben!L53*$B$5/Eingaben!L53)))*$I$16,0)","v":0}]
["Leistung nach Tagesverlauf  ",null,"Azimut",{"$f":"D27","v":"SolRose 26"},{"$f":"E27","v":"Synergie 210"},"Sunex AMX 2,85","Sunex 2,0","Star Azzurro CPC","Billig VRK"]
["Leistung bei eingetragener Fläche (KW)",null,-70,{"$f":"IF(D55>0,(Eingaben!L53*D55*$B$6/1000)*$D$5/$D$4,0)","v":0},{"$f":"IF(E55>0,(Eingaben!L53*E55*$B$6/1000)*$E$5/$E$4,0)","v":0},{"$f":"IF(F55>0,(Eingaben!L53*F55*$B$6/1000)*$F$5/$F$4,0)","v":0},{"$f":"IF(G55>0,(Eingaben!L53*G55*$B$6/1000)*$G$5/$G$4,0)","v":0},{"$f":"IF(H55>0,(Eingaben!L53*H55*$B$6/1000)*$H$5/$H$4,0)","v":0},{"$f":"IF(I55>0,(Eingaben!L53*I55*$B$6/1000)*$I$5/$I$4,0)","v":0}]
["Leistung bei eingetragener Fläche (KW)",null,-60,{"$f":"IF(D54>0,(Eingaben!L52*D54*$B$6/1000)*$D$5/$D$4,0)","v":0},{"$f":"IF(E54>0,(Eingaben!L52*E54*$B$6/1000)*$E$5/$E$4,0)","v":0},{"$f":"IF(F54>0,(Eingaben!L52*F54*$B$6/1000)*$F$5/$F$4,0)","v":0},{"$f":"IF(G54>0,(Eingaben!L52*G54*$B$6/1000)*$G$5/$G$4,0)","v":0},{"$f":"IF(H54>0,(Eingaben!L52*H54*$B$6/1000)*$H$5/$H$4,0)","v":0},{"$f":"IF(I54>0,(Eingaben!L52*I54*$B$6/1000)*$I$5/$I$4,0)","v":0}]
["Leistung bei eingetragener Fläche (KW)",null,-50,{"$f":"IF(D53>0,(Eingaben!L51*D53*$B$6/1000)*$D$5/$D$4,0)","v":0},{"$f":"IF(E53>0,(Eingaben!L51*E53*$B$6/1000)*$E$5/$E$4,0)","v":0},{"$f":"IF(F53>0,(Eingaben!L51*F53*$B$6/1000)*$F$5/$F$4,0)","v":0},{"$f":"IF(G53>0,(Eingaben!L51*G53*$B$6/1000)*$G$5/$G$4,0)","v":0},{"$f":"IF(H53>0,(Eingaben!L51*H53*$B$6/1000)*$H$5/$H$4,0)","v":0.17135436020000008},{"$f":"IF(I53>0,(Eingaben!L51*I53*$B$6/1000)*$I$5/$I$4,0)","v":0}]
["Leistung bei eingetragener Fläche (KW)",null,-40,{"$f":"IF(D52>0,(Eingaben!L50*D52*$B$6/1000)*$D$5/$D$4,0)","v":0.39546414043200029},{"$f":"IF(E52>0,(Eingaben!L50*E52*$B$6/1000)*$E$5/$E$4,0)","v":0.26766087329855093},{"$f":"IF(F52>0,(Eingaben!L50*F52*$B$6/1000)*$F$5/$F$4,0)","v":0.36102380300174225},{"$f":"IF(G52>0,(Eingaben!L50*G52*$B$6/1000)*$G$5/$G$4,0)","v":0.23142212675468002},{"$f":"IF(H52>0,(Eingaben!L50*H52*$B$6/1000)*$H$5/$H$4,0)","v":0.85879994376734703},{"$f":"IF(I52>0,(Eingaben!L50*I52*$B$6/1000)*$I$5/$I$4,0)","v":0.57487018658851696}]
["Leistung bei eingetragener Fläche (KW)",null,-30,{"$f":"IF(D51>0,(Eingaben!L49*D51*$B$6/1000)*$D$5/$D$4,0)","v":1.3673270289442507},{"$f":"IF(E51>0,(Eingaben!L49*E51*$B$6/1000)*$E$5/$E$4,0)","v":1.1691515770666676},{"$f":"IF(F51>0,(Eingaben!L49*F51*$B$6/1000)*$F$5/$F$4,0)","v":1.3063589249780494},{"$f":"IF(G51>0,(Eingaben!L49*G51*$B$6/1000)*$G$5/$G$4,0)","v":1.1288451621517248},{"$f":"IF(H51>0,(Eingaben!L49*H51*$B$6/1000)*$H$5/$H$4,0)","v":1.5866246794653067},{"$f":"IF(I51>0,(Eingaben!L49*I51*$B$6/1000)*$I$5/$I$4,0)","v":1.1521462273538281}]
["Leistung bei eingetragener Fläche (KW)",null,-20,{"$f":"IF(D50>0,(Eingaben!L48*D50*$B$6/1000)*$D$5/$D$4,0)","v":2.0062415457000005},{"$f":"IF(E50>0,(Eingaben!L48*E50*$B$6/1000)*$E$5/$E$4,0)","v":1.7666516506434786},{"$f":"IF(F50>0,(Eingaben!L48*F50*$B$6/1000)*$F$5/$F$4,0)","v":1.933198859282927},{"$f":"IF(G50>0,(Eingaben!L48*G50*$B$6/1000)*$G$5/$G$4,0)","v":1.72352706604138},{"$f":"IF(H50>0,(Eingaben!L48*H50*$B$6/1000)*$H$5/$H$4,0)","v":2.0358927467857151},{"$f":"IF(I50>0,(Eingaben!L48*I50*$B$6/1000)*$I$5/$I$4,0)","v":1.4173426032489957}]
["Leistung bei eingetragener Fläche (KW)",null,-10,{"$f":"IF(D49>0,(Eingaben!L47*D49*$B$6/1000)*$D$5/$D$4,0)","v":2.4879724002000012},{"$f":"IF(E49>0,(Eingaben!L47*E49*$B$6/1000)*$E$5/$E$4,0)","v":2.2403197681159424},{"$f":"IF(F49>0,(Eingaben!L47*F49*$B$6/1000)*$F$5/$F$4,0)","v":2.4302983404878047},{"$f":"IF(G49>0,(Eingaben!L47*G49*$B$6/1000)*$G$5/$G$4,0)","v":2.1948860027586212},{"$f":"IF(H49>0,(Eingaben!L47*H49*$B$6/1000)*$H$5/$H$4,0)","v":2.3941051297571434},{"$f":"IF(I49>0,(Eingaben!L47*I49*$B$6/1000)*$I$5/$I$4,0)","v":1.6410028563827759}]
["Leistung bei eingetragener Fläche (KW)",null,0,{"$f":"IF(D48>0,(Eingaben!L46*D48*$B$6/1000)*$D$5/$D$4,0)","v":2.5797306581999999},{"$f":"IF(E48>0,(Eingaben!L46*E48*$B$6/1000)*$E$5/$E$4,0)","v":2.3271432255072466},{"$f":"IF(F48>0,(Eingaben!L46*F48*$B$6/1000)*$F$5/$F$4,0)","v":2.5212644776306612},{"$f":"IF(G48>0,(Eingaben!L46*G48*$B$6/1000)*$G$5/$G$4,0)","v":2.2813525879802961},{"$f":"IF(H48>0,(Eingaben!L46*H48*$B$6/1000)*$H$5/$H$4,0)","v":2.4379564948979597},{"$f":"IF(I48>0,(Eingaben!L46*I48*$B$6/1000)*$I$5/$I$4,0)","v":1.6939882716555024}]
["Leistung bei eingetragener Fläche (KW)",null,10,{"$f":"IF(D49>0,(Eingaben!L47*D49*$B$6/1000)*$D$5/$D$4,0)","v":2.4879724002000012},{"$f":"IF(E49>0,(Eingaben!L47*E49*$B$6/1000)*$E$5/$E$4,0)","v":2.2403197681159424},{"$f":"IF(F49>0,(Eingaben!L47*F49*$B$6/1000)*$F$5/$F$4,0)","v":2.4302983404878047},{"$f":"IF(G49>0,(Eingaben!L47*G49*$B$6/1000)*$G$5/$G$4,0)","v":2.1948860027586212},{"$f":"IF(H49>0,(Eingaben!L47*H49*$B$6/1000)*$H$5/$H$4,0)","v":2.3941051297571434},{"$f":"IF(I49>0,(Eingaben!L47*I49*$B$6/1000)*$I$5/$I$4,0)","v":1.6410028563827759}]
["Leistung bei eingetragener Fläche (KW)",null,20,{"$f":"IF(D50>0,(Eingaben!L48*D50*$B$6/1000)*$D$5/$D$4,0)","v":2.0062415457000005},{"$f":"IF(E50>0,(Eingaben!L48*E50*$B$6/1000)*$E$5/$E$4,0)","v":1.7666516506434786},{"$f":"IF(F50>0,(Eingaben!L48*F50*$B$6/1000)*$F$5/$F$4,0)","v":1.933198859282927},{"$f":"IF(G50>0,(Eingaben!L48*G50*$B$6/1000)*$G$5/$G$4,0)","v":1.72352706604138},{"$f":"IF(H50>0,(Eingaben!L48*H50*$B$6/1000)*$H$5/$H$4,0)","v":2.0358927467857151},{"$f":"IF(I50>0,(Eingaben!L48*I50*$B$6/1000)*$I$5/$I$4,0)","v":1.4173426032489957}]
["Leistung bei eingetragener Fläche (KW)",null,30,{"$f":"IF(D51>0,(Eingaben!L49*D51*$B$6/1000)*$D$5/$D$4,0)","v":1.3673270289442507},{"$f":"IF(E51>0,(Eingaben!L49*E51*$B$6/1000)*$E$5/$E$4,0)","v":1.1691515770666676},{"$f":"IF(F51>0,(Eingaben!L49*F51*$B$6/1000)*$F$5/$F$4,0)","v":1.3063589249780494},{"$f":"IF(G51>0,(Eingaben!L49*G51*$B$6/1000)*$G$5/$G$4,0)","v":1.1288451621517248},{"$f":"IF(H51>0,(Eingaben!L49*H51*$B$6/1000)*$H$5/$H$4,0)","v":1.5866246794653067},{"$f":"IF(I51>0,(Eingaben!L49*I51*$B$6/1000)*$I$5/$I$4,0)","v":1.1521462273538281}]
["Leistung bei eingetragener Fläche (KW)",null,40,{"$f":"IF(D52>0,(Eingaben!L50*D52*$B$6/1000)*$D$5/$D$4,0)","v":0.39546414043200029},{"$f":"IF(E52>0,(Eingaben!L50*E52*$B$6/1000)*$E$5/$E$4,0)","v":0.26766087329855093},{"$f":"IF(F52>0,(Eingaben!L50*F52*$B$6/1000)*$F$5/$F$4,0)","v":0.36102380300174225},{"$f":"IF(G52>0,(Eingaben!L50*G52*$B$6/1000)*$G$5/$G$4,0)","v":0.23142212675468002},{"$f":"IF(H52>0,(Eingaben!L50*H52*$B$6/1000)*$H$5/$H$4,0)","v":0.85879994376734703},{"$f":"IF(I52>0,(Eingaben!L50*I52*$B$6/1000)*$I$5/$I$4,0)","v":0.57487018658851696}]
["Leistung bei eingetragener Fläche (KW)",null,50,{"$f":"IF(D53>0,(Eingaben!L51*D53*$B$6/1000)*$D$5/$D$4,0)","v":0},{"$f":"IF(E53>0,(Eingaben!L51*E53*$B$6/1000)*$E$5/$E$4,0)","v":0},{"$f":"IF(F53>0,(Eingaben!L51*F53*$B$6/1000)*$F$5/$F$4,0)","v":0},{"$f":"IF(G53>0,(Eingaben!L51*G53*$B$6/1000)*$G$5/$G$4,0)","v":0},{"$f":"IF(H53>0,(Eingaben!L51*H53*$B$6/1000)*$H$5/$H$4,0)","v":0.17135436020000008},{"$f":"IF(I53>0,(Eingaben!L51*I53*$B$6/1000)*$I$5/$I$4,0)","v":0}]
["Leistung bei eingetragener Fläche (KW)",null,60,{"$f":"IF(D54>0,(Eingaben!L52*D54*$B$6/1000)*$D$5/$D$4,0)","v":0},{"$f":"IF(E54>0,(Eingaben!L52*E54*$B$6/1000)*$E$5/$E$4,0)","v":0},{"$f":"IF(F54>0,(Eingaben!L52*F54*$B$6/1000)*$F$5/$F$4,0)","v":0},{"$f":"IF(G54>0,(Eingaben!L52*G54*$B$6/1000)*$G$5/$G$4,0)","v":0},{"$f":"IF(H54>0,(Eingaben!L52*H54*$B$6/1000)*$H$5/$H$4,0)","v":0},{"$f":"IF(I54>0,(Eingaben!L52*I54*$B$6/1000)*$I$5/$I$4,0)","v":0}]
["Leistung bei eingetragener Fläche (KW)",null,70,{"$f":"IF(D55>0,(Eingaben!L53*D55*$B$6/1000)*$D$5/$D$4,0)","v":0},{"$f":"IF(E55>0,(Eingaben!L53*E55*$B$6/1000)*$E$5/$E$4,0)","v":0},{"$f":"IF(F55>0,(Eingaben!L53*F55*$B$6/1000)*$F$5/$F$4,0)","v":0},{"$f":"IF(G55>0,(Eingaben!L53*G55*$B$6/1000)*$G$5/$G$4,0)","v":0},{"$f":"IF(H55>0,(Eingaben!L53*H55*$B$6/1000)*$H$5/$H$4,0)","v":0},{"$f":"IF(I55>0,(Eingaben!L53*I55*$B$6/1000)*$I$5/$I$4,0)","v":0}]
["KW Schnitt  > ",null,null,{"$f":"SUM(D57:D71)/15","v":1.0062493925835003},{"$f":"SUM(E57:E71)/15","v":0.88098073091710172},0.97220162220878059,0.85591422022620711,1.1021006809899323,0.75098080125358246]
["KWH gesamt bei Azimut -70 bis +70 > ",null,null,{"$f":"IF(D72>0,D72*$B$17,0)","v":7.5468704443762524},6.6073554818782627,7.2915121665658544,6.4193566516965532,8.2657551074244928,5.6323560094018683]
["Puffervolumen (L) > ",{"$f":"B45","v":1500},"Erwärmung (K)>",{"$f":"IF(D73>0,D73/(($B$45/1000)*1*1.163),0)","v":4.3260936912446279},{"$f":"IF(E73>0,E73/(($B$45/1000)*1*1.163),0)","v":3.7875353865739543},4.1797146268649206,3.6797687885907444,4.7381800558466569,3.2286362908580504]
["Laufzeit gesamt (Std.) > ",{"$f":"B17","v":7.5},{"$f":"\"Berechnung nach Tagesverlauf bei mittlerer Bewölkung (mit IAM) mit Diff. \"&B5&\"  bei  \"&B6&\" m²\"&\"  am \"","v":"Berechnung nach Tagesverlauf bei mittlerer Bewölkung (mit IAM) mit Diff. 28  bei  10,46 m²  am "},null,null,null,null,{"$f":"H17","v":"2013-12-21"}]
["Wirkungsgrad bei  Diff.0  > ",null,null,{"$f":"$D$6-$D$7*(0/1000)-$D$8*1000*((0/1000*0/1000))","v":0.81},{"$f":"$E$6-$E$7*(0/1000)-$E$8*1000*((0/1000*0/1000))","v":0.78500000000000003},{"$f":"$F$6-$F$7*(0/1000)-$F$8*1000*((0/1000*0/1000))","v":0.82},{"$f":"$G$6-$G$7*(0/1000)-$G$8*1000*((0/1000*0/1000))","v":0.8},{"$f":"$H$6-$H$7*(0/1000)-$H$8*1000*((0/1000*0/1000))","v":0.64},{"$f":"$I$6-$I$7*(0/1000)-$I$8*1000*((0/1000*0/1000))","v":0.65400000000000003}]
["Wirkungsgrad bei eingestellter Diff. bei   0° >",null,null,{"$f":"IF(Eingaben!L82>0,($D$6-$D$7*($B$5/Eingaben!L82)-$D$8*Eingaben!L82*(($B$5/Eingaben!L82*$B$5/Eingaben!L82)))*$D$9,0)","v":0.45978547634910066},{"$f":"IF(Eingaben!L82>0,($E$6-$E$7*($B$5/Eingaben!L82)-$E$8*Eingaben!L82*(($B$5/Eingaben!L82*$B$5/Eingaben!L82)))*$E$9,0)","v":0.40650566289140577},{"$f":"IF(Eingaben!L82>0,($F$6-$F$7*($B$5/Eingaben!L82)-$F$8*Eingaben!L82*(($B$5/Eingaben!L82*$B$5/Eingaben!L82)))*$F$9,0)","v":0.45307128580946021},{"$f":"IF(Eingaben!L82>0,($G$6-$G$7*($B$5/Eingaben!L82)-$G$8*Eingaben!L82*(($B$5/Eingaben!L82*$B$5/Eingaben!L82)))*$G$9,0)","v":0.401545636242505},{"$f":"IF(Eingaben!L82>0,($H$6-$H$7*($B$5/Eingaben!L82)-$H$8*Eingaben!L82*(($B$5/Eingaben!L82*$B$5/Eingaben!L82)))*$H$9,0)","v":0.55708194536975342},{"$f":"IF(Eingaben!L82>0,($I$6-$I$7*($B$5/Eingaben!L82)-$I$8*Eingaben!L82*(($B$5/Eingaben!L82*$B$5/Eingaben!L82)))*$I$9,0)","v":0.46700999333777482}]
["Wirkungsgrad bei eingestellter Diff. bei 10° >",null,null,{"$f":"IF(Eingaben!L83>0,($D$6-$D$7*($B$5/Eingaben!L83)-$D$8*Eingaben!L83*(($B$5/Eingaben!L83*$B$5/Eingaben!L83)))*$D$10,0)","v":0.45068899521531114},{"$f":"IF(Eingaben!L83>0,($E$6-$E$7*($B$5/Eingaben!L83)-$E$8*Eingaben!L83*(($B$5/Eingaben!L83*$B$5/Eingaben!L83)))*$E$10,0)","v":0.39667464114832546},{"$f":"IF(Eingaben!L83>0,($F$6-$F$7*($B$5/Eingaben!L83)-$F$8*Eingaben!L83*(($B$5/Eingaben!L83*$B$5/Eingaben!L83)))*$F$10,0)","v":0.44354066985645929},{"$f":"IF(Eingaben!L83>0,($G$6-$G$7*($B$5/Eingaben!L83)-$G$8*Eingaben!L83*(($B$5/Eingaben!L83*$B$5/Eingaben!L83)))*$G$10,0)","v":0.39119617224880393},{"$f":"IF(Eingaben!L83>0,($H$6-$H$7*($B$5/Eingaben!L83)-$H$8*Eingaben!L83*(($B$5/Eingaben!L83*$B$5/Eingaben!L83)))*$H$10,0)","v":0.56047751196172257},{"$f":"IF(Eingaben!L83>0,($I$6-$I$7*($B$5/Eingaben!L83)-$I$8*Eingaben!L83*(($B$5/Eingaben!L83*$B$5/Eingaben!L83)))*$I$10,0)","v":0.46215311004784693}]
["Wirkungsgrad bei eingestellter Diff. bei 20° >",null,null,{"$f":"IF(Eingaben!L84>0,($D$6-$D$7*($B$5/Eingaben!L84)-$D$8*Eingaben!L84*(($B$5/Eingaben!L84*$B$5/Eingaben!L84)))*$D$11,0)","v":0.39395567867036019},{"$f":"IF(Eingaben!L84>0,($E$6-$E$7*($B$5/Eingaben!L84)-$E$8*Eingaben!L84*(($B$5/Eingaben!L84*$B$5/Eingaben!L84)))*$E$11,0)","v":0.33200650969529089},{"$f":"IF(Eingaben!L84>0,($F$6-$F$7*($B$5/Eingaben!L84)-$F$8*Eingaben!L84*(($B$5/Eingaben!L84*$B$5/Eingaben!L84)))*$F$11,0)","v":0.38025872576177283},{"$f":"IF(Eingaben!L84>0,($G$6-$G$7*($B$5/Eingaben!L84)-$G$8*Eingaben!L84*(($B$5/Eingaben!L84*$B$5/Eingaben!L84)))*$G$11,0)","v":0.32338171745152361},{"$f":"IF(Eingaben!L84>0,($H$6-$H$7*($B$5/Eingaben!L84)-$H$8*Eingaben!L84*(($B$5/Eingaben!L84*$B$5/Eingaben!L84)))*$H$11,0)","v":0.5469108033240998},{"$f":"IF(Eingaben!L84>0,($I$6-$I$7*($B$5/Eingaben!L84)-$I$8*Eingaben!L84*(($B$5/Eingaben!L84*$B$5/Eingaben!L84)))*$I$11,0)","v":0.44913595567867043}]
["Wirkungsgrad bei eingestellter Diff. bei 30° >",null,null,{"$f":"IF(Eingaben!L85>0,($D$6-$D$7*($B$5/Eingaben!L85)-$D$8*Eingaben!L85*(($B$5/Eingaben!L85*$B$5/Eingaben!L85)))*$D$12,0)","v":0.28388055991041444},{"$f":"IF(Eingaben!L85>0,($E$6-$E$7*($B$5/Eingaben!L85)-$E$8*Eingaben!L85*(($B$5/Eingaben!L85*$B$5/Eingaben!L85)))*$E$12,0)","v":0.21510554933432879},{"$f":"IF(Eingaben!L85>0,($F$6-$F$7*($B$5/Eingaben!L85)-$F$8*Eingaben!L85*(($B$5/Eingaben!L85*$B$5/Eingaben!L85)))*$F$12,0)","v":0.26634002737339801},{"$f":"IF(Eingaben!L85>0,($G$6-$G$7*($B$5/Eingaben!L85)-$G$8*Eingaben!L85*(($B$5/Eingaben!L85*$B$5/Eingaben!L85)))*$G$12,0)","v":0.20057991787980595},{"$f":"IF(Eingaben!L85>0,($H$6-$H$7*($B$5/Eingaben!L85)-$H$8*Eingaben!L85*(($B$5/Eingaben!L85*$B$5/Eingaben!L85)))*$H$12,0)","v":0.52643523702874206},{"$f":"IF(Eingaben!L85>0,($I$6-$I$7*($B$5/Eingaben!L85)-$I$8*Eingaben!L85*(($B$5/Eingaben!L85*$B$5/Eingaben!L85)))*$I$12,0)","v":0.43081315167351003}]
["Wirkungsgrad bei eingestellter Diff. bei 40° >",null,null,{"$f":"IF(Eingaben!L86>0,($D$6-$D$7*($B$5/Eingaben!L86)-$D$8*Eingaben!L86*(($B$5/Eingaben!L86*$B$5/Eingaben!L86)))*$D$13,0)","v":-5.8943920430998567E-2},{"$f":"IF(Eingaben!L86>0,($E$6-$E$7*($B$5/Eingaben!L86)-$E$8*Eingaben!L86*(($B$5/Eingaben!L86*$B$5/Eingaben!L86)))*$E$13,0)","v":-0.1520624740986323},{"$f":"IF(Eingaben!L86>0,($F$6-$F$7*($B$5/Eingaben!L86)-$F$8*Eingaben!L86*(($B$5/Eingaben!L86*$B$5/Eingaben!L86)))*$F$13,0)","v":-9.0198342312474089E-2},{"$f":"IF(Eingaben!L86>0,($G$6-$G$7*($B$5/Eingaben!L86)-$G$8*Eingaben!L86*(($B$5/Eingaben!L86*$B$5/Eingaben!L86)))*$G$13,0)","v":-0.1856868628263571},{"$f":"IF(Eingaben!L86>0,($H$6-$H$7*($B$5/Eingaben!L86)-$H$8*Eingaben!L86*(($B$5/Eingaben!L86*$B$5/Eingaben!L86)))*$H$13,0)","v":0.44235789473684212},{"$f":"IF(Eingaben!L86>0,($I$6-$I$7*($B$5/Eingaben!L86)-$I$8*Eingaben!L86*(($B$5/Eingaben!L86*$B$5/Eingaben!L86)))*$I$13,0)","v":0.24535358474927479}]
["Wirkungsgrad bei eingestellter Diff. bei 50° >",null,null,{"$f":"IF(Eingaben!L87>0,($D$6-$D$7*($B$5/Eingaben!L87)-$D$8*Eingaben!L87*(($B$5/Eingaben!L87*$B$5/Eingaben!L87)))*$D$14,0)","v":-1.4058442105263158},{"$f":"IF(Eingaben!L87>0,($E$6-$E$7*($B$5/Eingaben!L87)-$E$8*Eingaben!L87*(($B$5/Eingaben!L87*$B$5/Eingaben!L87)))*$E$14,0)","v":-1.6043491228070172},{"$f":"IF(Eingaben!L87>0,($F$6-$F$7*($B$5/Eingaben!L87)-$F$8*Eingaben!L87*(($B$5/Eingaben!L87*$B$5/Eingaben!L87)))*$F$14,0)","v":-1.4998771929824561},{"$f":"IF(Eingaben!L87>0,($G$6-$G$7*($B$5/Eingaben!L87)-$G$8*Eingaben!L87*(($B$5/Eingaben!L87*$B$5/Eingaben!L87)))*$G$14,0)","v":-1.7320000000000004},{"$f":"IF(Eingaben!L87>0,($H$6-$H$7*($B$5/Eingaben!L87)-$H$8*Eingaben!L87*(($B$5/Eingaben!L87*$B$5/Eingaben!L87)))*$H$14,0)","v":9.2240350877192998E-2},{"$f":"IF(Eingaben!L87>0,($I$6-$I$7*($B$5/Eingaben!L87)-$I$8*Eingaben!L87*(($B$5/Eingaben!L87*$B$5/Eingaben!L87)))*$I$14,0)","v":-0.78474385964912297}]
["Wirkungsgrad bei eingestellter Diff. bei 60° >",null,null,{"$f":"IF(Eingaben!L88>0,($D$6-$D$7*($B$5/Eingaben!L88)-$D$8*Eingaben!L88*(($B$5/Eingaben!L88*$B$5/Eingaben!L88)))*$D$15,0)","v":0},{"$f":"IF(Eingaben!L88>0,($E$6-$E$7*($B$5/Eingaben!L88)-$E$8*Eingaben!L88*(($B$5/Eingaben!L88*$B$5/Eingaben!L88)))*$E$15,0)","v":0},{"$f":"IF(Eingaben!L88>0,($F$6-$F$7*($B$5/Eingaben!L88)-$F$8*Eingaben!L88*(($B$5/Eingaben!L88*$B$5/Eingaben!L88)))*$F$15,0)","v":0},{"$f":"IF(Eingaben!L88>0,($G$6-$G$7*($B$5/Eingaben!L88)-$G$8*Eingaben!L88*(($B$5/Eingaben!L88*$B$5/Eingaben!L88)))*$G$15,0)","v":0},{"$f":"IF(Eingaben!L88>0,($H$6-$H$7*($B$5/Eingaben!L88)-$H$8*Eingaben!L88*(($B$5/Eingaben!L88*$B$5/Eingaben!L88)))*$H$15,0)","v":0},{"$f":"IF(Eingaben!L88>0,($I$6-$I$7*($B$5/Eingaben!L88)-$I$8*Eingaben!L88*(($B$5/Eingaben!L88*$B$5/Eingaben!L88)))*$I$15,0)","v":0}]
["Wirkungsgrad bei eingestellter Diff. bei 70° >",null,null,{"$f":"IF(Eingaben!L89>0,($D$6-$D$7*($B$5/Eingaben!L89)-$D$8*Eingaben!L89*(($B$5/Eingaben!L89*$B$5/Eingaben!L89)))*$D$16,0)","v":0},{"$f":"IF(Eingaben!L89>0,($E$6-$E$7*($B$5/Eingaben!L89)-$E$8*Eingaben!L89*(($B$5/Eingaben!L89*$B$5/Eingaben!L89)))*$E$16,0)","v":0},{"$f":"IF(Eingaben!L89>0,($F$6-$F$7*($B$5/Eingaben!L89)-$F$8*Eingaben!L89*(($B$5/Eingaben!L89*$B$5/Eingaben!L89)))*$F$16,0)","v":0},{"$f":"IF(Eingaben!L89>0,($G$6-$G$7*($B$5/Eingaben!L89)-$G$8*Eingaben!L89*(($B$5/Eingaben!L89*$B$5/Eingaben!L89)))*$G$16,0)","v":0},{"$f":"IF(Eingaben!L89>0,($H$6-$H$7*($B$5/Eingaben!L89)-$H$8*Eingaben!L89*(($B$5/Eingaben!L89*$B$5/Eingaben!L89)))*$H$16,0)","v":0},{"$f":"IF(Eingaben!L89>0,($I$6-$I$7*($B$5/Eingaben!L89)-$I$8*Eingaben!L89*(($B$5/Eingaben!L89*$B$5/Eingaben!L89)))*$I$16,0)","v":0}]
["Leistung nach Tagesverlauf  ",null,"Azimut",{"$f":"D27","v":"SolRose 26"},{"$f":"E27","v":"Synergie 210"},"Sunex AMX 2,85","Sunex 2,0","Star Azzurro CPC","Billig VRK"]
["Leistung bei eingetragener Fläche (KW)",null,-70,{"$f":"IF(D84>0,(Eingaben!L89*D84*$B$6/1000)*$D$5/$D$4,0)","v":0},{"$f":"IF(E84>0,(Eingaben!L89*E84*$B$6/1000)*$E$5/$E$4,0)","v":0},{"$f":"IF(F84>0,(Eingaben!L89*F84*$B$6/1000)*$F$5/$F$4,0)","v":0},{"$f":"IF(G84>0,(Eingaben!L89*G84*$B$6/1000)*$G$5/$G$4,0)","v":0},{"$f":"IF(H84>0,(Eingaben!L89*H84*$B$6/1000)*$H$5/$H$4,0)","v":0},{"$f":"IF(I84>0,(Eingaben!L89*I84*$B$6/1000)*$I$5/$I$4,0)","v":0}]
["Leistung bei eingetragener Fläche (KW)",null,-60,{"$f":"IF(D83>0,(Eingaben!L88*D83*$B$6/1000)*$D$5/$D$4,0)","v":0},{"$f":"IF(E83>0,(Eingaben!L88*E83*$B$6/1000)*$E$5/$E$4,0)","v":0},{"$f":"IF(F83>0,(Eingaben!L88*F83*$B$6/1000)*$F$5/$F$4,0)","v":0},{"$f":"IF(G83>0,(Eingaben!L88*G83*$B$6/1000)*$G$5/$G$4,0)","v":0},{"$f":"IF(H83>0,(Eingaben!L88*H83*$B$6/1000)*$H$5/$H$4,0)","v":0},{"$f":"IF(I83>0,(Eingaben!L88*I83*$B$6/1000)*$I$5/$I$4,0)","v":0}]
["Leistung bei eingetragener Fläche (KW)",null,-50,{"$f":"IF(D82>0,(Eingaben!L87*D82*$B$6/1000)*$D$5/$D$4,0)","v":0},{"$f":"IF(E82>0,(Eingaben!L87*E82*$B$6/1000)*$E$5/$E$4,0)","v":0},{"$f":"IF(F82>0,(Eingaben!L87*F82*$B$6/1000)*$F$5/$F$4,0)","v":0},{"$f":"IF(G82>0,(Eingaben!L87*G82*$B$6/1000)*$G$5/$G$4,0)","v":0},{"$f":"IF(H82>0,(Eingaben!L87*H82*$B$6/1000)*$H$5/$H$4,0)","v":3.8945822600000006E-2},{"$f":"IF(I82>0,(Eingaben!L87*I82*$B$6/1000)*$I$5/$I$4,0)","v":0}]
["Leistung bei eingetragener Fläche (KW)",null,-40,{"$f":"IF(D81>0,(Eingaben!L86*D81*$B$6/1000)*$D$5/$D$4,0)","v":0},{"$f":"IF(E81>0,(Eingaben!L86*E81*$B$6/1000)*$E$5/$E$4,0)","v":0},{"$f":"IF(F81>0,(Eingaben!L86*F81*$B$6/1000)*$F$5/$F$4,0)","v":0},{"$f":"IF(G81>0,(Eingaben!L86*G81*$B$6/1000)*$G$5/$G$4,0)","v":0},{"$f":"IF(H81>0,(Eingaben!L86*H81*$B$6/1000)*$H$5/$H$4,0)","v":0.49416980004489813},{"$f":"IF(I81>0,(Eingaben!L86*I81*$B$6/1000)*$I$5/$I$4,0)","v":0.21037468402488041}]
["Leistung bei eingetragener Fläche (KW)",null,-30,{"$f":"IF(D80>0,(Eingaben!L85*D80*$B$6/1000)*$D$5/$D$4,0)","v":0.56679357680550035},{"$f":"IF(E80>0,(Eingaben!L85*E80*$B$6/1000)*$E$5/$E$4,0)","v":0.41932249317101478},{"$f":"IF(F80>0,(Eingaben!L85*F80*$B$6/1000)*$F$5/$F$4,0)","v":0.52075262307804882},{"$f":"IF(G80>0,(Eingaben!L85*G80*$B$6/1000)*$G$5/$G$4,0)","v":0.38209811553103462},{"$f":"IF(H80>0,(Eingaben!L85*H80*$B$6/1000)*$H$5/$H$4,0)","v":0.9793862905102042},{"$f":"IF(I80>0,(Eingaben!L85*I80*$B$6/1000)*$I$5/$I$4,0)","v":0.61517215944928239}]
["Leistung bei eingetragener Fläche (KW)",null,-20,{"$f":"IF(D79>0,(Eingaben!L84*D79*$B$6/1000)*$D$5/$D$4,0)","v":0.98925418620000027},{"$f":"IF(E79>0,(Eingaben!L84*E79*$B$6/1000)*$E$5/$E$4,0)","v":0.8139812644173916},{"$f":"IF(F79>0,(Eingaben!L84*F79*$B$6/1000)*$F$5/$F$4,0)","v":0.93507291948292703},{"$f":"IF(G79>0,(Eingaben!L84*G79*$B$6/1000)*$G$5/$G$4,0)","v":0.77477245969655206},{"$f":"IF(H79>0,(Eingaben!L84*H79*$B$6/1000)*$H$5/$H$4,0)","v":1.2796666049571435},{"$f":"IF(I79>0,(Eingaben!L84*I79*$B$6/1000)*$I$5/$I$4,0)","v":0.80659738320535912}]
["Leistung bei eingetragener Fläche (KW)",null,-10,{"$f":"IF(D78>0,(Eingaben!L83*D78*$B$6/1000)*$D$5/$D$4,0)","v":1.3104080892000007},{"$f":"IF(E78>0,(Eingaben!L83*E78*$B$6/1000)*$E$5/$E$4,0)","v":1.1260853982608701},{"$f":"IF(F78>0,(Eingaben!L83*F78*$B$6/1000)*$F$5/$F$4,0)","v":1.2628995804878049},{"$f":"IF(G78>0,(Eingaben!L83*G78*$B$6/1000)*$G$5/$G$4,0)","v":1.0852314924137938},{"$f":"IF(H78>0,(Eingaben!L83*H78*$B$6/1000)*$H$5/$H$4,0)","v":1.5184748602714293},{"$f":"IF(I78>0,(Eingaben!L83*I78*$B$6/1000)*$I$5/$I$4,0)","v":0.96102336038277536}]
["Leistung bei eingetragener Fläche (KW)",null,0,{"$f":"IF(D77>0,(Eingaben!L82*D77*$B$6/1000)*$D$5/$D$4,0)","v":1.3715802612000001},{"$f":"IF(E77>0,(Eingaben!L82*E77*$B$6/1000)*$E$5/$E$4,0)","v":1.1839677031884059},{"$f":"IF(F77>0,(Eingaben!L82*F77*$B$6/1000)*$F$5/$F$4,0)","v":1.3235436719163758},{"$f":"IF(G77>0,(Eingaben!L82*G77*$B$6/1000)*$G$5/$G$4,0)","v":1.1428758825615768},{"$f":"IF(H77>0,(Eingaben!L82*H77*$B$6/1000)*$H$5/$H$4,0)","v":1.5484773732653061},{"$f":"IF(I77>0,(Eingaben!L82*I77*$B$6/1000)*$I$5/$I$4,0)","v":0.99634697056459331}]
["Leistung bei eingetragener Fläche (KW)",null,10,{"$f":"IF(D78>0,(Eingaben!L83*D78*$B$6/1000)*$D$5/$D$4,0)","v":1.3104080892000007},{"$f":"IF(E78>0,(Eingaben!L83*E78*$B$6/1000)*$E$5/$E$4,0)","v":1.1260853982608701},{"$f":"IF(F78>0,(Eingaben!L83*F78*$B$6/1000)*$F$5/$F$4,0)","v":1.2628995804878049},{"$f":"IF(G78>0,(Eingaben!L83*G78*$B$6/1000)*$G$5/$G$4,0)","v":1.0852314924137938},{"$f":"IF(H78>0,(Eingaben!L83*H78*$B$6/1000)*$H$5/$H$4,0)","v":1.5184748602714293},{"$f":"IF(I78>0,(Eingaben!L83*I78*$B$6/1000)*$I$5/$I$4,0)","v":0.96102336038277536}]
["Leistung bei eingetragener Fläche (KW)",null,20,{"$f":"IF(D79>0,(Eingaben!L84*D79*$B$6/1000)*$D$5/$D$4,0)","v":0.98925418620000027},{"$f":"IF(E79>0,(Eingaben!L84*E79*$B$6/1000)*$E$5/$E$4,0)","v":0.8139812644173916},{"$f":"IF(F79>0,(Eingaben!L84*F79*$B$6/1000)*$F$5/$F$4,0)","v":0.93507291948292703},{"$f":"IF(G79>0,(Eingaben!L84*G79*$B$6/1000)*$G$5/$G$4,0)","v":0.77477245969655206},{"$f":"IF(H79>0,(Eingaben!L84*H79*$B$6/1000)*$H$5/$H$4,0)","v":1.2796666049571435},{"$f":"IF(I79>0,(Eingaben!L84*I79*$B$6/1000)*$I$5/$I$4,0)","v":0.80659738320535912}]
["Leistung bei eingetragener Fläche (KW)",null,30,{"$f":"IF(D80>0,(Eingaben!L85*D80*$B$6/1000)*$D$5/$D$4,0)","v":0.56679357680550035},{"$f":"IF(E80>0,(Eingaben!L85*E80*$B$6/1000)*$E$5/$E$4,0)","v":0.41932249317101478},{"$f":"IF(F80>0,(Eingaben!L85*F80*$B$6/1000)*$F$5/$F$4,0)","v":0.52075262307804882},{"$f":"IF(G80>0,(Eingaben!L85*G80*$B$6/1000)*$G$5/$G$4,0)","v":0.38209811553103462},{"$f":"IF(H80>0,(Eingaben!L85*H80*$B$6/1000)*$H$5/$H$4,0)","v":0.9793862905102042},{"$f":"IF(I80>0,(Eingaben!L85*I80*$B$6/1000)*$I$5/$I$4,0)","v":0.61517215944928239}]
["Leistung bei eingetragener Fläche (KW)",null,40,{"$f":"IF(D81>0,(Eingaben!L86*D81*$B$6/1000)*$D$5/$D$4,0)","v":0},{"$f":"IF(E81>0,(Eingaben!L86*E81*$B$6/1000)*$E$5/$E$4,0)","v":0},{"$f":"IF(F81>0,(Eingaben!L86*F81*$B$6/1000)*$F$5/$F$4,0)","v":0},{"$f":"IF(G81>0,(Eingaben!L86*G81*$B$6/1000)*$G$5/$G$4,0)","v":0},{"$f":"IF(H81>0,(Eingaben!L86*H81*$B$6/1000)*$H$5/$H$4,0)","v":0.49416980004489813},{"$f":"IF(I81>0,(Eingaben!L86*I81*$B$6/1000)*$I$5/$I$4,0)","v":0.21037468402488041}]
["Leistung bei eingetragener Fläche (KW)",null,50,{"$f":"IF(D82>0,(Eingaben!L87*D82*$B$6/1000)*$D$5/$D$4,0)","v":0},{"$f":"IF(E82>0,(Eingaben!L87*E82*$B$6/1000)*$E$5/$E$4,0)","v":0},{"$f":"IF(F82>0,(Eingaben!L87*F82*$B$6/1000)*$F$5/$F$4,0)","v":0},{"$f":"IF(G82>0,(Eingaben!L87*G82*$B$6/1000)*$G$5/$G$4,0)","v":0},{"$f":"IF(H82>0,(Eingaben!L87*H82*$B$6/1000)*$H$5/$H$4,0)","v":3.8945822600000006E-2},{"$f":"IF(I82>0,(Eingaben!L87*I82*$B$6/1000)*$I$5/$I$4,0)","v":0}]
["Leistung bei eingetragener Fläche (KW)",null,60,{"$f":"IF(D83>0,(Eingaben!L88*D83*$B$6/1000)*$D$5/$D$4,0)","v":0},{"$f":"IF(E83>0,(Eingaben!L88*E83*$B$6/1000)*$E$5/$E$4,0)","v":0},{"$f":"IF(F83>0,(Eingaben!L88*F83*$B$6/1000)*$F$5/$F$4,0)","v":0},{"$f":"IF(G83>0,(Eingaben!L88*G83*$B$6/1000)*$G$5/$G$4,0)","v":0},{"$f":"IF(H83>0,(Eingaben!L88*H83*$B$6/1000)*$H$5/$H$4,0)","v":0},{"$f":"IF(I83>0,(Eingaben!L88*I83*$B$6/1000)*$I$5/$I$4,0)","v":0}]
["Leistung bei eingetragener Fläche (KW)",null,70,{"$f":"IF(D84>0,(Eingaben!L89*D84*$B$6/1000)*$D$5/$D$4,0)","v":0},{"$f":"IF(E84>0,(Eingaben!L89*E84*$B$6/1000)*$E$5/$E$4,0)","v":0},{"$f":"IF(F84>0,(Eingaben!L89*F84*$B$6/1000)*$F$5/$F$4,0)","v":0},{"$f":"IF(G84>0,(Eingaben!L89*G84*$B$6/1000)*$G$5/$G$4,0)","v":0},{"$f":"IF(H84>0,(Eingaben!L89*H84*$B$6/1000)*$H$5/$H$4,0)","v":0},{"$f":"IF(I84>0,(Eingaben!L89*I84*$B$6/1000)*$I$5/$I$4,0)","v":0}]
["KW Schnitt  > ",null,null,{"$f":"SUM(D86:D100)/15","v":0.47363279770740013},{"$f":"SUM(E86:E100)/15","v":0.39351640099246399},0.45073292786759578,0.37513866785628919,0.67798427533551042,0.41217880964594583]
["KWH gesamt bei Azimut -70 bis +70 > ",null,null,{"$f":"IF(D101>0,D101*$B$17,0)","v":3.5522459828055011},2.9513730074434799,3.3804969590069684,2.8135400089221689,5.0848820650163278,3.0913410723445938]
["Puffervolumen (L) > ",{"$f":"B45","v":1500},"Erwärmung (K)>",{"$f":"IF(D102>0,D102/(($B$45/1000)*1*1.163),0)","v":2.0362545043310409},{"$f":"IF(E102>0,E102/(($B$45/1000)*1*1.163),0)","v":1.6918159973880653},1.9378027853293027,1.6128059667080361,2.9148077185533552,1.7720499124933184]
["Laufzeit gesamt (Std.) > ",{"$f":"B17","v":7.5},{"$f":"\"Berechnung nach Tagesverlauf bei starker Bewölkung (mit IAM) mit Diff. \"&B5&\"  bei  \"&B6&\" m²\"&\"  am \"","v":"Berechnung nach Tagesverlauf bei starker Bewölkung (mit IAM) mit Diff. 28  bei  10,46 m²  am "},null,null,null,null,{"$f":"H17","v":"2013-12-21"}]
["Wirkungsgrad bei  Diff.0  > ",null,null,{"$f":"$D$6-$D$7*(0/1000)-$D$8*1000*((0/1000*0/1000))","v":0.81},{"$f":"$E$6-$E$7*(0/1000)-$E$8*1000*((0/1000*0/1000))","v":0.78500000000000003},{"$f":"$F$6-$F$7*(0/1000)-$F$8*1000*((0/1000*0/1000))","v":0.82},{"$f":"$G$6-$G$7*(0/1000)-$G$8*1000*((0/1000*0/1000))","v":0.8},{"$f":"$H$6-$H$7*(0/1000)-$H$8*1000*((0/1000*0/1000))","v":0.64},{"$f":"$I$6-$I$7*(0/1000)-$I$8*1000*((0/1000*0/1000))","v":0.65400000000000003}]
["Wirkungsgrad bei eingestellter Diff. bei   0° >",null,null,{"$f":"IF(Eingaben!L124>0,($D$6-$D$7*($B$5/Eingaben!L124)-$D$8*Eingaben!L124*(($B$5/Eingaben!L124*$B$5/Eingaben!L124)))*$D$9,0)","v":0.10957095269820125},{"$f":"IF(Eingaben!L124>0,($E$6-$E$7*($B$5/Eingaben!L124)-$E$8*Eingaben!L124*(($B$5/Eingaben!L124*$B$5/Eingaben!L124)))*$E$9,0)","v":2.8011325782811458E-2},{"$f":"IF(Eingaben!L124>0,($F$6-$F$7*($B$5/Eingaben!L124)-$F$8*Eingaben!L124*(($B$5/Eingaben!L124*$B$5/Eingaben!L124)))*$F$9,0)","v":8.6142571618920596E-2},{"$f":"IF(Eingaben!L124>0,($G$6-$G$7*($B$5/Eingaben!L124)-$G$8*Eingaben!L124*(($B$5/Eingaben!L124*$B$5/Eingaben!L124)))*$G$9,0)","v":3.0912724850099341E-3},{"$f":"IF(Eingaben!L124>0,($H$6-$H$7*($B$5/Eingaben!L124)-$H$8*Eingaben!L124*(($B$5/Eingaben!L124*$B$5/Eingaben!L124)))*$H$9,0)","v":0.47416389073950704},{"$f":"IF(Eingaben!L124>0,($I$6-$I$7*($B$5/Eingaben!L124)-$I$8*Eingaben!L124*(($B$5/Eingaben!L124*$B$5/Eingaben!L124)))*$I$9,0)","v":0.28001998667554961}]
["Wirkungsgrad bei eingestellter Diff. bei 10° >",null,null,{"$f":"IF(Eingaben!L125>0,($D$6-$D$7*($B$5/Eingaben!L125)-$D$8*Eingaben!L125*(($B$5/Eingaben!L125*$B$5/Eingaben!L125)))*$D$10,0)","v":9.1377990430622197E-2},{"$f":"IF(Eingaben!L125>0,($E$6-$E$7*($B$5/Eingaben!L125)-$E$8*Eingaben!L125*(($B$5/Eingaben!L125*$B$5/Eingaben!L125)))*$E$10,0)","v":8.3492822966508562E-3},{"$f":"IF(Eingaben!L125>0,($F$6-$F$7*($B$5/Eingaben!L125)-$F$8*Eingaben!L125*(($B$5/Eingaben!L125*$B$5/Eingaben!L125)))*$F$10,0)","v":6.7081339712918728E-2},{"$f":"IF(Eingaben!L125>0,($G$6-$G$7*($B$5/Eingaben!L125)-$G$8*Eingaben!L125*(($B$5/Eingaben!L125*$B$5/Eingaben!L125)))*$G$10,0)","v":-1.760765550239219E-2},{"$f":"IF(Eingaben!L125>0,($H$6-$H$7*($B$5/Eingaben!L125)-$H$8*Eingaben!L125*(($B$5/Eingaben!L125*$B$5/Eingaben!L125)))*$H$10,0)","v":0.47455502392344501},{"$f":"IF(Eingaben!L125>0,($I$6-$I$7*($B$5/Eingaben!L125)-$I$8*Eingaben!L125*(($B$5/Eingaben!L125*$B$5/Eingaben!L125)))*$I$10,0)","v":0.27030622009569383}]
["Wirkungsgrad bei eingestellter Diff. bei 20° >",null,null,{"$f":"IF(Eingaben!L126>0,($D$6-$D$7*($B$5/Eingaben!L126)-$D$8*Eingaben!L126*(($B$5/Eingaben!L126*$B$5/Eingaben!L126)))*$D$11,0)","v":-2.2088642659279623E-2},{"$f":"IF(Eingaben!L126>0,($E$6-$E$7*($B$5/Eingaben!L126)-$E$8*Eingaben!L126*(($B$5/Eingaben!L126*$B$5/Eingaben!L126)))*$E$11,0)","v":-0.11313698060941826},{"$f":"IF(Eingaben!L126>0,($F$6-$F$7*($B$5/Eingaben!L126)-$F$8*Eingaben!L126*(($B$5/Eingaben!L126*$B$5/Eingaben!L126)))*$F$11,0)","v":-5.1282548476454332E-2},{"$f":"IF(Eingaben!L126>0,($G$6-$G$7*($B$5/Eingaben!L126)-$G$8*Eingaben!L126*(($B$5/Eingaben!L126*$B$5/Eingaben!L126)))*$G$11,0)","v":-0.14523656509695285},{"$f":"IF(Eingaben!L126>0,($H$6-$H$7*($B$5/Eingaben!L126)-$H$8*Eingaben!L126*(($B$5/Eingaben!L126*$B$5/Eingaben!L126)))*$H$11,0)","v":0.44742160664819947},{"$f":"IF(Eingaben!L126>0,($I$6-$I$7*($B$5/Eingaben!L126)-$I$8*Eingaben!L126*(($B$5/Eingaben!L126*$B$5/Eingaben!L126)))*$I$11,0)","v":0.21811191135734073}]
["Wirkungsgrad bei eingestellter Diff. bei 30° >",null,null,{"$f":"IF(Eingaben!L127>0,($D$6-$D$7*($B$5/Eingaben!L127)-$D$8*Eingaben!L127*(($B$5/Eingaben!L127*$B$5/Eingaben!L127)))*$D$12,0)","v":-0.23413888017917114},{"$f":"IF(Eingaben!L127>0,($E$6-$E$7*($B$5/Eingaben!L127)-$E$8*Eingaben!L127*(($B$5/Eingaben!L127*$B$5/Eingaben!L127)))*$E$12,0)","v":-0.3390889013313424},{"$f":"IF(Eingaben!L127>0,($F$6-$F$7*($B$5/Eingaben!L127)-$F$8*Eingaben!L127*(($B$5/Eingaben!L127*$B$5/Eingaben!L127)))*$F$12,0)","v":-0.2709199452532039},{"$f":"IF(Eingaben!L127>0,($G$6-$G$7*($B$5/Eingaben!L127)-$G$8*Eingaben!L127*(($B$5/Eingaben!L127*$B$5/Eingaben!L127)))*$G$12,0)","v":-0.38284016424038814},{"$f":"IF(Eingaben!L127>0,($H$6-$H$7*($B$5/Eingaben!L127)-$H$8*Eingaben!L127*(($B$5/Eingaben!L127*$B$5/Eingaben!L127)))*$H$12,0)","v":0.40007047405748414},{"$f":"IF(Eingaben!L127>0,($I$6-$I$7*($B$5/Eingaben!L127)-$I$8*Eingaben!L127*(($B$5/Eingaben!L127*$B$5/Eingaben!L127)))*$I$12,0)","v":0.1095263033470201}]
["Wirkungsgrad bei eingestellter Diff. bei 40° >",null,null,{"$f":"IF(Eingaben!L128>0,($D$6-$D$7*($B$5/Eingaben!L128)-$D$8*Eingaben!L128*(($B$5/Eingaben!L128*$B$5/Eingaben!L128)))*$D$13,0)","v":-0.89548784086199718},{"$f":"IF(Eingaben!L128>0,($E$6-$E$7*($B$5/Eingaben!L128)-$E$8*Eingaben!L128*(($B$5/Eingaben!L128*$B$5/Eingaben!L128)))*$E$13,0)","v":-1.0655749481972645},{"$f":"IF(Eingaben!L128>0,($F$6-$F$7*($B$5/Eingaben!L128)-$F$8*Eingaben!L128*(($B$5/Eingaben!L128*$B$5/Eingaben!L128)))*$F$13,0)","v":-0.97579668462494817},{"$f":"IF(Eingaben!L128>0,($G$6-$G$7*($B$5/Eingaben!L128)-$G$8*Eingaben!L128*(($B$5/Eingaben!L128*$B$5/Eingaben!L128)))*$G$13,0)","v":-1.1473737256527141},{"$f":"IF(Eingaben!L128>0,($H$6-$H$7*($B$5/Eingaben!L128)-$H$8*Eingaben!L128*(($B$5/Eingaben!L128*$B$5/Eingaben!L128)))*$H$13,0)","v":0.23191578947368427},{"$f":"IF(Eingaben!L128>0,($I$6-$I$7*($B$5/Eingaben!L128)-$I$8*Eingaben!L128*(($B$5/Eingaben!L128*$B$5/Eingaben!L128)))*$I$13,0)","v":-0.35949283050145048}]
["Wirkungsgrad bei eingestellter Diff. bei 50° >",null,null,{"$f":"IF(Eingaben!L129>0,($D$6-$D$7*($B$5/Eingaben!L129)-$D$8*Eingaben!L129*(($B$5/Eingaben!L129*$B$5/Eingaben!L129)))*$D$14,0)","v":-3.5730884210526317},{"$f":"IF(Eingaben!L129>0,($E$6-$E$7*($B$5/Eingaben!L129)-$E$8*Eingaben!L129*(($B$5/Eingaben!L129*$B$5/Eingaben!L129)))*$E$14,0)","v":-3.9465982456140347},{"$f":"IF(Eingaben!L129>0,($F$6-$F$7*($B$5/Eingaben!L129)-$F$8*Eingaben!L129*(($B$5/Eingaben!L129*$B$5/Eingaben!L129)))*$F$14,0)","v":-3.7705543859649122},{"$f":"IF(Eingaben!L129>0,($G$6-$G$7*($B$5/Eingaben!L129)-$G$8*Eingaben!L129*(($B$5/Eingaben!L129*$B$5/Eingaben!L129)))*$G$14,0)","v":-4.2240000000000002},{"$f":"IF(Eingaben!L129>0,($H$6-$H$7*($B$5/Eingaben!L129)-$H$8*Eingaben!L129*(($B$5/Eingaben!L129*$B$5/Eingaben!L129)))*$H$14,0)","v":-0.44271929824561401},{"$f":"IF(Eingaben!L129>0,($I$6-$I$7*($B$5/Eingaben!L129)-$I$8*Eingaben!L129*(($B$5/Eingaben!L129*$B$5/Eingaben!L129)))*$I$14,0)","v":-2.4589277192982464}]
["Wirkungsgrad bei eingestellter Diff. bei 60° >",null,null,{"$f":"IF(Eingaben!L130>0,($D$6-$D$7*($B$5/Eingaben!L130)-$D$8*Eingaben!L130*(($B$5/Eingaben!L130*$B$5/Eingaben!L130)))*$D$15,0)","v":0},{"$f":"IF(Eingaben!L130>0,($E$6-$E$7*($B$5/Eingaben!L130)-$E$8*Eingaben!L130*(($B$5/Eingaben!L130*$B$5/Eingaben!L130)))*$E$15,0)","v":0},{"$f":"IF(Eingaben!L130>0,($F$6-$F$7*($B$5/Eingaben!L130)-$F$8*Eingaben!L130*(($B$5/Eingaben!L130*$B$5/Eingaben!L130)))*$F$15,0)","v":0},{"$f":"IF(Eingaben!L130>0,($G$6-$G$7*($B$5/Eingaben!L130)-$G$8*Eingaben!L130*(($B$5/Eingaben!L130*$B$5/Eingaben!L130)))*$G$15,0)","v":0},{"$f":"IF(Eingaben!L130>0,($H$6-$H$7*($B$5/Eingaben!L130)-$H$8*Eingaben!L130*(($B$5/Eingaben!L130*$B$5/Eingaben!L130)))*$H$15,0)","v":0},{"$f":"IF(Eingaben!L130>0,($I$6-$I$7*($B$5/Eingaben!L130)-$I$8*Eingaben!L130*(($B$5/Eingaben!L130*$B$5/Eingaben!L130)))*$I$15,0)","v":0}]
["Wirkungsgrad bei eingestellter Diff. bei 70° >",null,null,{"$f":"IF(Eingaben!L131>0,($D$6-$D$7*($B$5/Eingaben!L131)-$D$8*Eingaben!L131*(($B$5/Eingaben!L131*$B$5/Eingaben!L131)))*$D$16,0)","v":0},{"$f":"IF(Eingaben!L131>0,($E$6-$E$7*($B$5/Eingaben!L131)-$E$8*Eingaben!L131*(($B$5/Eingaben!L131*$B$5/Eingaben!L131)))*$E$16,0)","v":0},{"$f":"IF(Eingaben!L131>0,($F$6-$F$7*($B$5/Eingaben!L131)-$F$8*Eingaben!L131*(($B$5/Eingaben!L131*$B$5/Eingaben!L131)))*$F$16,0)","v":0},{"$f":"IF(Eingaben!L131>0,($G$6-$G$7*($B$5/Eingaben!L131)-$G$8*Eingaben!L131*(($B$5/Eingaben!L131*$B$5/Eingaben!L131)))*$G$16,0)","v":0},{"$f":"IF(Eingaben!L131>0,($H$6-$H$7*($B$5/Eingaben!L131)-$H$8*Eingaben!L131*(($B$5/Eingaben!L131*$B$5/Eingaben!L131)))*$H$16,0)","v":0},{"$f":"IF(Eingaben!L131>0,($I$6-$I$7*($B$5/Eingaben!L131)-$I$8*Eingaben!L131*(($B$5/Eingaben!L131*$B$5/Eingaben!L131)))*$I$16,0)","v":0}]
["Leistung nach Tagesverlauf  ",null,"Azimut",{"$f":"D27","v":"SolRose 26"},{"$f":"E27","v":"Synergie 210"},"Sunex AMX 2,85","Sunex 2,0","Star Azzurro CPC","Billig VRK"]
["Leistung bei eingetragener Fläche (KW)",null,-70,{"$f":"IF(D113>0,(Eingaben!L131*D113*$B$6/1000)*$D$5/$D$4,0)","v":0},{"$f":"IF(E113>0,(Eingaben!L131*E113*$B$6/1000)*$E$5/$E$4,0)","v":0},{"$f":"IF(F113>0,(Eingaben!L131*F113*$B$6/1000)*$F$5/$F$4,0)","v":0},{"$f":"IF(G113>0,(Eingaben!L131*G113*$B$6/1000)*$G$5/$G$4,0)","v":0},{"$f":"IF(H113>0,(Eingaben!L131*H113*$B$6/1000)*$H$5/$H$4,0)","v":0},{"$f":"IF(I113>0,(Eingaben!L131*I113*$B$6/1000)*$I$5/$I$4,0)","v":0}]
["Leistung bei eingetragener Fläche (KW)",null,-60,{"$f":"IF(D112>0,(Eingaben!L130*D112*$B$6/1000)*$D$5/$D$4,0)","v":0},{"$f":"IF(E112>0,(Eingaben!L130*E112*$B$6/1000)*$E$5/$E$4,0)","v":0},{"$f":"IF(F112>0,(Eingaben!L130*F112*$B$6/1000)*$F$5/$F$4,0)","v":0},{"$f":"IF(G112>0,(Eingaben!L130*G112*$B$6/1000)*$G$5/$G$4,0)","v":0},{"$f":"IF(H112>0,(Eingaben!L130*H112*$B$6/1000)*$H$5/$H$4,0)","v":0},{"$f":"IF(I112>0,(Eingaben!L130*I112*$B$6/1000)*$I$5/$I$4,0)","v":0}]
["Leistung bei eingetragener Fläche (KW)",null,-50,{"$f":"IF(D111>0,(Eingaben!L129*D111*$B$6/1000)*$D$5/$D$4,0)","v":0},{"$f":"IF(E111>0,(Eingaben!L129*E111*$B$6/1000)*$E$5/$E$4,0)","v":0},{"$f":"IF(F111>0,(Eingaben!L129*F111*$B$6/1000)*$F$5/$F$4,0)","v":0},{"$f":"IF(G111>0,(Eingaben!L129*G111*$B$6/1000)*$G$5/$G$4,0)","v":0},{"$f":"IF(H111>0,(Eingaben!L129*H111*$B$6/1000)*$H$5/$H$4,0)","v":0},{"$f":"IF(I111>0,(Eingaben!L129*I111*$B$6/1000)*$I$5/$I$4,0)","v":0}]
["Leistung bei eingetragener Fläche (KW)",null,-40,{"$f":"IF(D110>0,(Eingaben!L128*D110*$B$6/1000)*$D$5/$D$4,0)","v":0},{"$f":"IF(E110>0,(Eingaben!L128*E110*$B$6/1000)*$E$5/$E$4,0)","v":0},{"$f":"IF(F110>0,(Eingaben!L128*F110*$B$6/1000)*$F$5/$F$4,0)","v":0},{"$f":"IF(G110>0,(Eingaben!L128*G110*$B$6/1000)*$G$5/$G$4,0)","v":0},{"$f":"IF(H110>0,(Eingaben!L128*H110*$B$6/1000)*$H$5/$H$4,0)","v":0.12953965632244904},{"$f":"IF(I110>0,(Eingaben!L128*I110*$B$6/1000)*$I$5/$I$4,0)","v":0}]
["Leistung bei eingetragener Fläche (KW)",null,-30,{"$f":"IF(D109>0,(Eingaben!L127*D109*$B$6/1000)*$D$5/$D$4,0)","v":0},{"$f":"IF(E109>0,(Eingaben!L127*E109*$B$6/1000)*$E$5/$E$4,0)","v":0},{"$f":"IF(F109>0,(Eingaben!L127*F109*$B$6/1000)*$F$5/$F$4,0)","v":0},{"$f":"IF(G109>0,(Eingaben!L127*G109*$B$6/1000)*$G$5/$G$4,0)","v":0},{"$f":"IF(H109>0,(Eingaben!L127*H109*$B$6/1000)*$H$5/$H$4,0)","v":0.37214790155510213},{"$f":"IF(I109>0,(Eingaben!L127*I109*$B$6/1000)*$I$5/$I$4,0)","v":7.8198091544736892E-2}]
["Leistung bei eingetragener Fläche (KW)",null,-20,{"$f":"IF(D108>0,(Eingaben!L126*D108*$B$6/1000)*$D$5/$D$4,0)","v":0},{"$f":"IF(E108>0,(Eingaben!L126*E108*$B$6/1000)*$E$5/$E$4,0)","v":0},{"$f":"IF(F108>0,(Eingaben!L126*F108*$B$6/1000)*$F$5/$F$4,0)","v":0},{"$f":"IF(G108>0,(Eingaben!L126*G108*$B$6/1000)*$G$5/$G$4,0)","v":0},{"$f":"IF(H108>0,(Eingaben!L126*H108*$B$6/1000)*$H$5/$H$4,0)","v":0.52344046312857162},{"$f":"IF(I108>0,(Eingaben!L126*I108*$B$6/1000)*$I$5/$I$4,0)","v":0.19585216316172255}]
["Leistung bei eingetragener Fläche (KW)",null,-10,{"$f":"IF(D107>0,(Eingaben!L125*D107*$B$6/1000)*$D$5/$D$4,0)","v":0.13284377820000029},{"$f":"IF(E107>0,(Eingaben!L125*E107*$B$6/1000)*$E$5/$E$4,0)","v":1.18510284057973E-2},{"$f":"IF(F107>0,(Eingaben!L125*F107*$B$6/1000)*$F$5/$F$4,0)","v":9.5500820487804991E-2},{"$f":"IF(G107>0,(Eingaben!L125*G107*$B$6/1000)*$G$5/$G$4,0)","v":0},{"$f":"IF(H107>0,(Eingaben!L125*H107*$B$6/1000)*$H$5/$H$4,0)","v":0.64284459078571443},{"$f":"IF(I107>0,(Eingaben!L125*I107*$B$6/1000)*$I$5/$I$4,0)","v":0.28104386438277523}]
["Leistung bei eingetragener Fläche (KW)",null,0,{"$f":"IF(D106>0,(Eingaben!L124*D106*$B$6/1000)*$D$5/$D$4,0)","v":0.16342986420000011},{"$f":"IF(E106>0,(Eingaben!L124*E106*$B$6/1000)*$E$5/$E$4,0)","v":4.0792180869565223E-2},{"$f":"IF(F106>0,(Eingaben!L124*F106*$B$6/1000)*$F$5/$F$4,0)","v":0.12582286620209041},{"$f":"IF(G106>0,(Eingaben!L124*G106*$B$6/1000)*$G$5/$G$4,0)","v":4.3991771428570584E-3},{"$f":"IF(H106>0,(Eingaben!L124*H106*$B$6/1000)*$H$5/$H$4,0)","v":0.65899825163265335},{"$f":"IF(I106>0,(Eingaben!L124*I106*$B$6/1000)*$I$5/$I$4,0)","v":0.29870566947368421}]
["Leistung bei eingetragener Fläche (KW)",null,10,{"$f":"IF(D107>0,(Eingaben!L125*D107*$B$6/1000)*$D$5/$D$4,0)","v":0.13284377820000029},{"$f":"IF(E107>0,(Eingaben!L125*E107*$B$6/1000)*$E$5/$E$4,0)","v":1.18510284057973E-2},{"$f":"IF(F107>0,(Eingaben!L125*F107*$B$6/1000)*$F$5/$F$4,0)","v":9.5500820487804991E-2},{"$f":"IF(G107>0,(Eingaben!L125*G107*$B$6/1000)*$G$5/$G$4,0)","v":0},{"$f":"IF(H107>0,(Eingaben!L125*H107*$B$6/1000)*$H$5/$H$4,0)","v":0.64284459078571443},{"$f":"IF(I107>0,(Eingaben!L125*I107*$B$6/1000)*$I$5/$I$4,0)","v":0.28104386438277523}]
["Leistung bei eingetragener Fläche (KW)",null,20,{"$f":"IF(D108>0,(Eingaben!L126*D108*$B$6/1000)*$D$5/$D$4,0)","v":0},{"$f":"IF(E108>0,(Eingaben!L126*E108*$B$6/1000)*$E$5/$E$4,0)","v":0},{"$f":"IF(F108>0,(Eingaben!L126*F108*$B$6/1000)*$F$5/$F$4,0)","v":0},{"$f":"IF(G108>0,(Eingaben!L126*G108*$B$6/1000)*$G$5/$G$4,0)","v":0},{"$f":"IF(H108>0,(Eingaben!L126*H108*$B$6/1000)*$H$5/$H$4,0)","v":0.52344046312857162},{"$f":"IF(I108>0,(Eingaben!L126*I108*$B$6/1000)*$I$5/$I$4,0)","v":0.19585216316172255}]
["Leistung bei eingetragener Fläche (KW)",null,30,{"$f":"IF(D109>0,(Eingaben!L127*D109*$B$6/1000)*$D$5/$D$4,0)","v":0},{"$f":"IF(E109>0,(Eingaben!L127*E109*$B$6/1000)*$E$5/$E$4,0)","v":0},{"$f":"IF(F109>0,(Eingaben!L127*F109*$B$6/1000)*$F$5/$F$4,0)","v":0},{"$f":"IF(G109>0,(Eingaben!L127*G109*$B$6/1000)*$G$5/$G$4,0)","v":0},{"$f":"IF(H109>0,(Eingaben!L127*H109*$B$6/1000)*$H$5/$H$4,0)","v":0.37214790155510213},{"$f":"IF(I109>0,(Eingaben!L127*I109*$B$6/1000)*$I$5/$I$4,0)","v":7.8198091544736892E-2}]
["Leistung bei eingetragener Fläche (KW)",null,40,{"$f":"IF(D110>0,(Eingaben!L128*D110*$B$6/1000)*$D$5/$D$4,0)","v":0},{"$f":"IF(E110>0,(Eingaben!L128*E110*$B$6/1000)*$E$5/$E$4,0)","v":0},{"$f":"IF(F110>0,(Eingaben!L128*F110*$B$6/1000)*$F$5/$F$4,0)","v":0},{"$f":"IF(G110>0,(Eingaben!L128*G110*$B$6/1000)*$G$5/$G$4,0)","v":0},{"$f":"IF(H110>0,(Eingaben!L128*H110*$B$6/1000)*$H$5/$H$4,0)","v":0.12953965632244904},{"$f":"IF(I110>0,(Eingaben!L128*I110*$B$6/1000)*$I$5/$I$4,0)","v":0}]
["Leistung bei eingetragener Fläche (KW)",null,50,{"$f":"IF(D111>0,(Eingaben!L129*D111*$B$6/1000)*$D$5/$D$4,0)","v":0},{"$f":"IF(E111>0,(Eingaben!L129*E111*$B$6/1000)*$E$5/$E$4,0)","v":0},{"$f":"IF(F111>0,(Eingaben!L129*F111*$B$6/1000)*$F$5/$F$4,0)","v":0},{"$f":"IF(G111>0,(Eingaben!L129*G111*$B$6/1000)*$G$5/$G$4,0)","v":0},{"$f":"IF(H111>0,(Eingaben!L129*H111*$B$6/1000)*$H$5/$H$4,0)","v":0},{"$f":"IF(I111>0,(Eingaben!L129*I111*$B$6/1000)*$I$5/$I$4,0)","v":0}]
["Leistung bei eingetragener Fläche (KW)",null,60,{"$f":"IF(D112>0,(Eingaben!L130*D112*$B$6/1000)*$D$5/$D$4,0)","v":0},{"$f":"IF(E112>0,(Eingaben!L130*E112*$B$6/1000)*$E$5/$E$4,0)","v":0},{"$f":"IF(F112>0,(Eingaben!L130*F112*$B$6/1000)*$F$5/$F$4,0)","v":0},{"$f":"IF(G112>0,(Eingaben!L130*G112*$B$6/1000)*$G$5/$G$4,0)","v":0},{"$f":"IF(H112>0,(Eingaben!L130*H112*$B$6/1000)*$H$5/$H$4,0)","v":0},{"$f":"IF(I112>0,(Eingaben!L130*I112*$B$6/1000)*$I$5/$I$4,0)","v":0}]
["Leistung bei eingetragener Fläche (KW)",null,70,{"$f":"IF(D113>0,(Eingaben!L131*D113*$B$6/1000)*$D$5/$D$4,0)","v":0},{"$f":"IF(E113>0,(Eingaben!L131*E113*$B$6/1000)*$E$5/$E$4,0)","v":0},{"$f":"IF(F113>0,(Eingaben!L131*F113*$B$6/1000)*$F$5/$F$4,0)","v":0},{"$f":"IF(G113>0,(Eingaben!L131*G113*$B$6/1000)*$G$5/$G$4,0)","v":0},{"$f":"IF(H113>0,(Eingaben!L131*H113*$B$6/1000)*$H$5/$H$4,0)","v":0},{"$f":"IF(I113>0,(Eingaben!L131*I113*$B$6/1000)*$I$5/$I$4,0)","v":0}]
["KW Schnitt  > ",null,null,{"$f":"SUM(D115:D129)/15","v":2.8607828040000047E-2},{"$f":"SUM(E115:E129)/15","v":4.2996158454106544E-3},2.1121633811846691E-2,2.9327847619047058E-4,0.26632956501442184,9.3926260510143578E-2]
["KWH gesamt bei Azimut -70 bis +70 > ",null,null,{"$f":"IF(D130>0,D130*$B$17,0)","v":0.21455871030000034},3.2247118840579909E-2,0.15841225358885019,2.1995885714285292E-3,1.9974717376081639,0.7044469538260768]
["Puffervolumen (L) > ",{"$f":"B45","v":1500},"Erwärmung (K)>",{"$f":"IF(D131>0,D131/(($B$45/1000)*1*1.163),0)","v":0.12299152209802255},{"$f":"IF(E131>0,E131/(($B$45/1000)*1*1.163),0)","v":1.8485020831516142E-2},9.080668018850685E-2,1.260870490930656E-3,1.1450110275770502,0.40381023435143415]

{"sheet":"Sommer","index":3,"n_rows":132,"n_cols":9,"rows_kept":132,"cut":false,"hidden":false,"merged":[[127,0,127,1],[128,0,128,1],[129,0,129,2],[130,0,130,2],[122,0,122,1],[123,0,123,1],[124,0,124,1],[125,0,125,1],[126,0,126,1],[117,0,117,1],[118,0,118,1],[119,0,119,1],[120,0,120,1],[121,0,121,1],[103,2,103,6],[113,0,113,1],[114,0,114,1],[115,0,115,1],[116,0,116,1],[108,0,108,2],[109,0,109,2],[110,0,110,2],[111,0,111,2],[112,0,112,2],[101,0,101,2],[104,0,104,2],[105,0,105,2],[106,0,106,2],[107,0,107,2],[96,0,96,1],[97,0,97,1],[98,0,98,1],[99,0,99,1],[100,0,100,2],[91,0,91,1],[92,0,92,1],[93,0,93,1],[94,0,94,1],[95,0,95,1],[86,0,86,1],[87,0,87,1],[88,0,88,1],[89,0,89,1],[90,0,90,1],[82,0,82,2],[83,0,83,2],[74,2,74,6],[84,0,84,1],[85,0,85,1],[77,0,77,2],[78,0,78,2],[79,0,79,2],[80,0,80,2],[81,0,81,2],[70,0,70,1],[71,0,71,2],[72,0,72,2],[75,0,75,2],[76,0,76,2],[65,0,65,1],[66,0,66,1],[67,0,67,1],[68,0,68,1],[69,0,69,1],[60,0,60,1],[61,0,61,1],[62,0,62,1],[63,0,63,1],[64,0,64,1],[55,0,55,1],[56,0,56,1],[57,0,57,1],[58,0,58,1],[59,0,59,1],[51,0,51,2],[52,0,52,2],[53,0,53,2],[54,0,54,2],[45,2,45,6],[46,0,46,2],[47,0,47,2],[48,0,48,2],[49,0,49,2],[50,0,50,2],[26,0,26,1],[34,0,34,1],[35,0,35,1],[36,0,36,1],[37,0,37,1],[27,0,27,1],[28,0,28,1],[29,0,29,1],[30,0,30,1],[43,0,43,2],[42,0,42,2],[31,0,31,1],[32,0,32,1],[33,0,33,1],[39,0,39,1],[40,0,40,1],[41,0,41,1],[38,0,38,1],[16,2,16,6],[20,0,20,2],[21,0,21,2],[22,0,22,2],[23,0,23,2],[24,0,24,2],[25,0,25,2],[19,0,19,2],[0,0,0,8],[2,0,3,1],[6,0,6,1],[17,0,17,2],[18,0,18,2]]}
["Solartirol Tool     Sommer                   Berechnung eines Tagesverlaufes mit IAM (Beispielort Breitengrad 48,8 Kollektorneigung 50°, Strahlung mit Getsolar ermittelt)"]
[null,null,"Infos > ",{"$f":"Herbstfrühjahr!D2","v":0},{"$f":"Herbstfrühjahr!E2","v":0},{"$f":"Herbstfrühjahr!F2","v":0},{"$f":"Herbstfrühjahr!G2","v":0},{"$f":"Herbstfrühjahr!H2","v":0},{"$f":"Herbstfrühjahr!I2","v":0}]
["allgemeine Eingaben",null,"Kollektor > ",{"$f":"Herbstfrühjahr!D3","v":"SolRose 26"},{"$f":"Herbstfrühjahr!E3","v":"Synergie 210"},{"$f":"Herbstfrühjahr!F3","v":"Sunex AMX 2,85"},{"$f":"Herbstfrühjahr!G3","v":"Sunex 2,0"},{"$f":"Herbstfrühjahr!H3","v":"Star Azzurro CPC"},{"$f":"Herbstfrühjahr!I3","v":"Billig VRK"}]
[null,null,"Bruttofl.(m²)",{"$f":"Herbstfrühjahr!D4","v":2.6},{"$f":"Herbstfrühjahr!E4","v":2.0699999999999998},{"$f":"Herbstfrühjahr!F4","v":2.87},{"$f":"Herbstfrühjahr!G4","v":2.0299999999999998},{"$f":"Herbstfrühjahr!H4","v":3.92},{"$f":"Herbstfrühjahr!I4","v":4.18}]
["Berechnung zu Diff.",{"$f":"Eingaben!B5","v":35},"Aperturfl. (m²)",{"$f":"Herbstfrühjahr!D5","v":2.4700000000000002},{"$f":"Herbstfrühjahr!E5","v":1.92},{"$f":"Herbstfrühjahr!F5","v":2.67},{"$f":"Herbstfrühjahr!G5","v":1.84},{"$f":"Herbstfrühjahr!H5","v":3.47},{"$f":"Herbstfrühjahr!I5","v":2.84}]
[" Gesamtfläche (m²)",{"$f":"Eingaben!B6","v":10.46},"η0",{"$f":"Herbstfrühjahr!D6","v":0.81},{"$f":"Herbstfrühjahr!E6","v":0.78500000000000003},{"$f":"Herbstfrühjahr!F6","v":0.82},{"$f":"Herbstfrühjahr!G6","v":0.8},{"$f":"Herbstfrühjahr!H6","v":0.64},{"$f":"Herbstfrühjahr!I6","v":0.65400000000000003}]
["Strahlungseingaben zu Datum",null,"a1",{"$f":"Herbstfrühjahr!D7","v":3.36},{"$f":"Herbstfrühjahr!E7","v":3.722},{"$f":"Herbstfrühjahr!F7","v":3.29},{"$f":"Herbstfrühjahr!G7","v":4.16},{"$f":"Herbstfrühjahr!H7","v":0.749},{"$f":"Herbstfrühjahr!I7","v":1.82}]
["GBS zu Datum (W/m²)",{"$f":"Eingaben!L31","v":"2013-06-21"},"a2",{"$f":"Herbstfrühjahr!D8","v":1.41E-2},{"$f":"Herbstfrühjahr!E8","v":1.2E-2},{"$f":"Herbstfrühjahr!F8","v":2.3E-2},{"$f":"Herbstfrühjahr!G8","v":4.0000000000000001E-3},{"$f":"Herbstfrühjahr!H8","v":5.0000000000000001E-3},{"$f":"Herbstfrühjahr!I8","v":6.6E-3}]
["Strahlung   0°",{"$f":"Eingaben!L32","v":993},"IAM 0°",{"$f":"Herbstfrühjahr!D9","v":1},{"$f":"Herbstfrühjahr!E9","v":1},{"$f":"Herbstfrühjahr!F9","v":1},{"$f":"Herbstfrühjahr!G9","v":1},{"$f":"Herbstfrühjahr!H9","v":1},{"$f":"Herbstfrühjahr!I9","v":1}]
["Strahlung 10°",{"$f":"Eingaben!L33","v":990},"IAM 10°",{"$f":"Herbstfrühjahr!D10","v":1},{"$f":"Herbstfrühjahr!E10","v":1},{"$f":"Herbstfrühjahr!F10","v":1},{"$f":"Herbstfrühjahr!G10","v":1},{"$f":"Herbstfrühjahr!H10","v":1.01},{"$f":"Herbstfrühjahr!I10","v":1}]
["Strahlung 20°",{"$f":"Eingaben!L34","v":977},"IAM 20°",{"$f":"Herbstfrühjahr!D11","v":1},{"$f":"Herbstfrühjahr!E11","v":0.99},{"$f":"Herbstfrühjahr!F11","v":0.99},{"$f":"Herbstfrühjahr!G11","v":0.99},{"$f":"Herbstfrühjahr!H11","v":1.01},{"$f":"Herbstfrühjahr!I11","v":1.04}]
["Strahlung 30°",{"$f":"Eingaben!L35","v":955.00000000000011},"IAM 30°",{"$f":"Herbstfrühjahr!D12","v":0.99},{"$f":"Herbstfrühjahr!E12","v":0.98},{"$f":"Herbstfrühjahr!F12","v":0.98},{"$f":"Herbstfrühjahr!G12","v":0.98},{"$f":"Herbstfrühjahr!H12","v":1.02},{"$f":"Herbstfrühjahr!I12","v":1.1499999999999999}]
["Strahlung 40°",{"$f":"Eingaben!L36","v":919.99999999999989},"IAM 40°",{"$f":"Herbstfrühjahr!D13","v":0.96},{"$f":"Herbstfrühjahr!E13","v":0.97},{"$f":"Herbstfrühjahr!F13","v":0.97},{"$f":"Herbstfrühjahr!G13","v":0.97},{"$f":"Herbstfrühjahr!H13","v":1.02},{"$f":"Herbstfrühjahr!I13","v":1.3}]
["Strahlung 50°",{"$f":"Eingaben!L37","v":865},"IAM 50°",{"$f":"Herbstfrühjahr!D14","v":0.94},{"$f":"Herbstfrühjahr!E14","v":0.94},{"$f":"Herbstfrühjahr!F14","v":0.94},{"$f":"Herbstfrühjahr!G14","v":0.95},{"$f":"Herbstfrühjahr!H14","v":0.98},{"$f":"Herbstfrühjahr!I14","v":1.36}]
["Strahlung 60°",{"$f":"Eingaben!L38","v":786},"IAM 60°",{"$f":"Herbstfrühjahr!D15","v":0.86},{"$f":"Herbstfrühjahr!E15","v":0.9},{"$f":"Herbstfrühjahr!F15","v":0.9},{"$f":"Herbstfrühjahr!G15","v":0.9},{"$f":"Herbstfrühjahr!H15","v":1.05},{"$f":"Herbstfrühjahr!I15","v":1.34}]
["Strahlung 70°",{"$f":"Eingaben!L39","v":673},"IAM 70°",{"$f":"Herbstfrühjahr!D16","v":0.73},{"$f":"Herbstfrühjahr!E16","v":0.8},{"$f":"Herbstfrühjahr!F16","v":0.81},{"$f":"Herbstfrühjahr!G16","v":0.81},{"$f":"Herbstfrühjahr!H16","v":1.1399999999999999},{"$f":"Herbstfrühjahr!I16","v":1.1100000000000001}]
["Laufzeit gesamt (Std.) > ",{"$f":"Eingaben!L40","v":5.9},{"$f":"\"Berechnung nach Tagesverlauf bei Sonne (mit IAM) mit Diff. \"&B5&\"  bei  \"&B6&\" m²\"&\"  am \"","v":"Berechnung nach Tagesverlauf bei Sonne (mit IAM) mit Diff. 35  bei  10,46 m²  am "},{"$f":"\"Berechnung nach Tagesverlauf (mit IAM) mit Diff. \"&B5&\"  bei  \"&B6&\" m²\"&\"  am \"","v":"Berechnung nach Tagesverlauf (mit IAM) mit Diff. 35  bei  10,46 m²  am "},null,null,null,{"$f":"B8","v":"2013-06-21"}]
["Tageswirkungsgrad bei Sonne (%) > ",null,null,{"$f":"IF(D44>0,D44/(Eingaben!$M$4/100),\"\")","v":59.022126866791758},{"$f":"IF(E44>0,E44/(Eingaben!$M$4/100),\"\")","v":55.008188117573511},{"$f":"IF(F44>0,F44/(Eingaben!$M$4/100),\"\")","v":58.491513065875232},{"$f":"IF(G44>0,G44/(Eingaben!$M$4/100),\"\")","v":54.642695921404105},{"$f":"IF(H44>0,H44/(Eingaben!$M$4/100),\"\")","v":54.80600933491597},{"$f":"IF(I44>0,I44/(Eingaben!$M$4/100),\"\")","v":45.402074526243972}]
["Wirkungsgrad bei eingestellter Diff. bei   0° >",null,null,{"$f":"IF($B$9>0,($D$6-$D$7*($B$5/$B$9)-$D$8*$B$9*(($B$5/$B$9*$B$5/$B$9)))*$D$9,0)","v":0.67417673716012094},{"$f":"IF($B$9>0,($E$6-$E$7*($B$5/$B$9)-$E$8*$B$9*(($B$5/$B$9*$B$5/$B$9)))*$E$9,0)","v":0.63900805639476344},{"$f":"IF($B$9>0,($F$6-$F$7*($B$5/$B$9)-$F$8*$B$9*(($B$5/$B$9*$B$5/$B$9)))*$F$9,0)","v":0.6756646525679757},{"$f":"IF($B$9>0,($G$6-$G$7*($B$5/$B$9)-$G$8*$B$9*(($B$5/$B$9*$B$5/$B$9)))*$G$9,0)","v":0.64843907351460228},{"$f":"IF($B$9>0,($H$6-$H$7*($B$5/$B$9)-$H$8*$B$9*(($B$5/$B$9*$B$5/$B$9)))*$H$9,0)","v":0.6074320241691844},{"$f":"IF($B$9>0,($I$6-$I$7*($B$5/$B$9)-$I$8*$B$9*(($B$5/$B$9*$B$5/$B$9)))*$I$9,0)","v":0.58170896273917427}]
["Wirkungsgrad bei eingestellter Diff. bei 10° >",null,null,{"$f":"IF($B$10>0,($D$6-$D$7*($B$5/$B$10)-$D$8*$B$10*(($B$5/$B$10*$B$5/$B$10)))*$D$10,0)","v":0.67376515151515159},{"$f":"IF($B$10>0,($E$6-$E$7*($B$5/$B$10)-$E$8*$B$10*(($B$5/$B$10*$B$5/$B$10)))*$E$10,0)","v":0.63856565656565656},{"$f":"IF($B$10>0,($F$6-$F$7*($B$5/$B$10)-$F$8*$B$10*(($B$5/$B$10*$B$5/$B$10)))*$F$10,0)","v":0.67522727272727279},{"$f":"IF($B$10>0,($G$6-$G$7*($B$5/$B$10)-$G$8*$B$10*(($B$5/$B$10*$B$5/$B$10)))*$G$10,0)","v":0.64797979797979799},{"$f":"IF($B$10>0,($H$6-$H$7*($B$5/$B$10)-$H$8*$B$10*(($B$5/$B$10*$B$5/$B$10)))*$H$10,0)","v":0.61340666666666677},{"$f":"IF($B$10>0,($I$6-$I$7*($B$5/$B$10)-$I$8*$B$10*(($B$5/$B$10*$B$5/$B$10)))*$I$10,0)","v":0.581489898989899}]
["Wirkungsgrad bei eingestellter Diff. bei 20° >",null,null,{"$f":"IF($B$11>0,($D$6-$D$7*($B$5/$B$11)-$D$8*$B$11*(($B$5/$B$11*$B$5/$B$11)))*$D$11,0)","v":0.67195240532241551},{"$f":"IF($B$11>0,($E$6-$E$7*($B$5/$B$11)-$E$8*$B$11*(($B$5/$B$11*$B$5/$B$11)))*$E$11,0)","v":0.63025102354145357},{"$f":"IF($B$11>0,($F$6-$F$7*($B$5/$B$11)-$F$8*$B$11*(($B$5/$B$11*$B$5/$B$11)))*$F$11,0)","v":0.66656791197543497},{"$f":"IF($B$11>0,($G$6-$G$7*($B$5/$B$11)-$G$8*$B$11*(($B$5/$B$11*$B$5/$B$11)))*$G$11,0)","v":0.63949744114636642},{"$f":"IF($B$11>0,($H$6-$H$7*($B$5/$B$11)-$H$8*$B$11*(($B$5/$B$11*$B$5/$B$11)))*$H$11,0)","v":0.61296765609007176},{"$f":"IF($B$11>0,($I$6-$I$7*($B$5/$B$11)-$I$8*$B$11*(($B$5/$B$11*$B$5/$B$11)))*$I$11,0)","v":0.60374607983623341}]
["Wirkungsgrad bei eingestellter Diff. bei 30° >",null,null,{"$f":"IF($B$12>0,($D$6-$D$7*($B$5/$B$12)-$D$8*$B$12*(($B$5/$B$12*$B$5/$B$12)))*$D$12,0)","v":0.66208452879581159},{"$f":"IF($B$12>0,($E$6-$E$7*($B$5/$B$12)-$E$8*$B$12*(($B$5/$B$12*$B$5/$B$12)))*$E$12,0)","v":0.62053497382198963},{"$f":"IF($B$12>0,($F$6-$F$7*($B$5/$B$12)-$F$8*$B$12*(($B$5/$B$12*$B$5/$B$12)))*$F$12,0)","v":0.65652303664921463},{"$f":"IF($B$12>0,($G$6-$G$7*($B$5/$B$12)-$G$8*$B$12*(($B$5/$B$12*$B$5/$B$12)))*$G$12,0)","v":0.62956020942408386},{"$f":"IF($B$12>0,($H$6-$H$7*($B$5/$B$12)-$H$8*$B$12*(($B$5/$B$12*$B$5/$B$12)))*$H$12,0)","v":0.61825884816753929},{"$f":"IF($B$12>0,($I$6-$I$7*($B$5/$B$12)-$I$8*$B$12*(($B$5/$B$12*$B$5/$B$12)))*$I$12,0)","v":0.6656573298429318}]
["Wirkungsgrad bei eingestellter Diff. bei 40° >",null,null,{"$f":"IF($B$13>0,($D$6-$D$7*($B$5/$B$13)-$D$8*$B$13*(($B$5/$B$13*$B$5/$B$13)))*$D$13,0)","v":0.63686347826086953},{"$f":"IF($B$13>0,($E$6-$E$7*($B$5/$B$13)-$E$8*$B$13*(($B$5/$B$13*$B$5/$B$13)))*$E$13,0)","v":0.60860119565217397},{"$f":"IF($B$13>0,($F$6-$F$7*($B$5/$B$13)-$F$8*$B$13*(($B$5/$B$13*$B$5/$B$13)))*$F$13,0)","v":0.64428559782608685},{"$f":"IF($B$13>0,($G$6-$G$7*($B$5/$B$13)-$G$8*$B$13*(($B$5/$B$13*$B$5/$B$13)))*$G$13,0)","v":0.61732065217391308},{"$f":"IF($B$13>0,($H$6-$H$7*($B$5/$B$13)-$H$8*$B$13*(($B$5/$B$13*$B$5/$B$13)))*$H$13,0)","v":0.61694478260869567},{"$f":"IF($B$13>0,($I$6-$I$7*($B$5/$B$13)-$I$8*$B$13*(($B$5/$B$13*$B$5/$B$13)))*$I$13,0)","v":0.74876467391304358}]
["Wirkungsgrad bei eingestellter Diff. bei 50° >",null,null,{"$f":"IF($B$14>0,($D$6-$D$7*($B$5/$B$14)-$D$8*$B$14*(($B$5/$B$14*$B$5/$B$14)))*$D$14,0)","v":0.61483335260115612},{"$f":"IF($B$14>0,($E$6-$E$7*($B$5/$B$14)-$E$8*$B$14*(($B$5/$B$14*$B$5/$B$14)))*$E$14,0)","v":0.58036034682080928},{"$f":"IF($B$14>0,($F$6-$F$7*($B$5/$B$14)-$F$8*$B$14*(($B$5/$B$14*$B$5/$B$14)))*$F$14,0)","v":0.61504797687861268},{"$f":"IF($B$14>0,($G$6-$G$7*($B$5/$B$14)-$G$8*$B$14*(($B$5/$B$14*$B$5/$B$14)))*$G$14,0)","v":0.5947109826589595},{"$f":"IF($B$14>0,($H$6-$H$7*($B$5/$B$14)-$H$8*$B$14*(($B$5/$B$14*$B$5/$B$14)))*$H$14,0)","v":0.59056046242774574},{"$f":"IF($B$14>0,($I$6-$I$7*($B$5/$B$14)-$I$8*$B$14*(($B$5/$B$14*$B$5/$B$14)))*$I$14,0)","v":0.77657572254335272}]
["Wirkungsgrad bei eingestellter Diff. bei 60° >",null,null,{"$f":"IF($B$15>0,($D$6-$D$7*($B$5/$B$15)-$D$8*$B$15*(($B$5/$B$15*$B$5/$B$15)))*$D$15,0)","v":0.54902958015267178},{"$f":"IF($B$15>0,($E$6-$E$7*($B$5/$B$15)-$E$8*$B$15*(($B$5/$B$15*$B$5/$B$15)))*$E$15,0)","v":0.54050381679389325},{"$f":"IF($B$15>0,($F$6-$F$7*($B$5/$B$15)-$F$8*$B$15*(($B$5/$B$15*$B$5/$B$15)))*$F$15,0)","v":0.57388740458015264},{"$f":"IF($B$15>0,($G$6-$G$7*($B$5/$B$15)-$G$8*$B$15*(($B$5/$B$15*$B$5/$B$15)))*$G$15,0)","v":0.54767175572519089},{"$f":"IF($B$15>0,($H$6-$H$7*($B$5/$B$15)-$H$8*$B$15*(($B$5/$B$15*$B$5/$B$15)))*$H$15,0)","v":0.62879770992366402},{"$f":"IF($B$15>0,($I$6-$I$7*($B$5/$B$15)-$I$8*$B$15*(($B$5/$B$15*$B$5/$B$15)))*$I$15,0)","v":0.75397844783715018}]
["Wirkungsgrad bei eingestellter Diff. bei 70° >",null,null,{"$f":"IF($B$16>0,($D$6-$D$7*($B$5/$B$16)-$D$8*$B$16*(($B$5/$B$16*$B$5/$B$16)))*$D$16,0)","v":0.44500442050520062},{"$f":"IF($B$16>0,($E$6-$E$7*($B$5/$B$16)-$E$8*$B$16*(($B$5/$B$16*$B$5/$B$16)))*$E$16,0)","v":0.45567310549777118},{"$f":"IF($B$16>0,($F$6-$F$7*($B$5/$B$16)-$F$8*$B$16*(($B$5/$B$16*$B$5/$B$16)))*$F$16,0)","v":0.49169888558692426},{"$f":"IF($B$16>0,($G$6-$G$7*($B$5/$B$16)-$G$8*$B$16*(($B$5/$B$16*$B$5/$B$16)))*$G$16,0)","v":0.46686329866270437},{"$f":"IF($B$16>0,($H$6-$H$7*($B$5/$B$16)-$H$8*$B$16*(($B$5/$B$16*$B$5/$B$16)))*$H$16,0)","v":0.67481901931649335},{"$f":"IF($B$16>0,($I$6-$I$7*($B$5/$B$16)-$I$8*$B$16*(($B$5/$B$16*$B$5/$B$16)))*$I$16,0)","v":0.60754274888558701}]
["Leistung nach Tagesverlauf  ",null,"Azimut",{"$f":"IF(D3>0,D3,\"\")","v":"SolRose 26"},{"$f":"IF(E3>0,E3,\"\")","v":"Synergie 210"},"Sunex AMX 2,85","Sunex 2,0","Star Azzurro CPC","Billig VRK"]
["Leistung bei eingetragener Fläche (KW)",null,-70,{"$f":"IF(D26>0,($B$16*D26*$B$6/1000)*$D$5/$D$4,0)","v":2.9760120075750005},{"$f":"IF(E26>0,($B$16*E26*$B$6/1000)*$E$5/$E$4,0)","v":2.9753018249275365},{"$f":"IF(F26>0,($B$16*F26*$B$6/1000)*$F$5/$F$4,0)","v":3.220144328038328},{"$f":"IF(G26>0,($B$16*G26*$B$6/1000)*$G$5/$G$4,0)","v":2.9789160756650261},{"$f":"IF(H26>0,($B$16*H26*$B$6/1000)*$H$5/$H$4,0)","v":4.2051110657755109},{"$f":"IF(I26>0,($B$16*I26*$B$6/1000)*$I$5/$I$4,0)","v":2.9057995280210531}]
["Leistung bei eingetragener Fläche (KW)",null,-60,{"$f":"IF(D25>0,($B$15*D25*$B$6/1000)*$D$5/$D$4,0)","v":4.2881856532500002},{"$f":"IF(E25>0,($B$15*E25*$B$6/1000)*$E$5/$E$4,0)","v":4.1217711860869581},{"$f":"IF(F25>0,($B$15*F25*$B$6/1000)*$F$5/$F$4,0)","v":4.3894518394076654},{"$f":"IF(G25>0,($B$15*G25*$B$6/1000)*$G$5/$G$4,0)","v":4.0812797083743853},{"$f":"IF(H25>0,($B$15*H25*$B$6/1000)*$H$5/$H$4,0)","v":4.5762378589285708},{"$f":"IF(I25>0,($B$15*I25*$B$6/1000)*$I$5/$I$4,0)","v":4.2116785873645934}]
["Leistung bei eingetragener Fläche (KW)",null,-50,{"$f":"IF(D24>0,($B$14*D24*$B$6/1000)*$D$5/$D$4,0)","v":5.2848031564500006},{"$f":"IF(E24>0,($B$14*E24*$B$6/1000)*$E$5/$E$4,0)","v":4.8705320644637684},{"$f":"IF(F24>0,($B$14*F24*$B$6/1000)*$F$5/$F$4,0)","v":5.177095196968641},{"$f":"IF(G24>0,($B$14*G24*$B$6/1000)*$G$5/$G$4,0)","v":4.8772558226600999},{"$f":"IF(H24>0,($B$14*H24*$B$6/1000)*$H$5/$H$4,0)","v":4.729939303000001},{"$f":"IF(I24>0,($B$14*I24*$B$6/1000)*$I$5/$I$4,0)","v":4.7739037615311011}]
["Leistung bei eingetragener Fläche (KW)",null,-40,{"$f":"IF(D23>0,($B$13*D23*$B$6/1000)*$D$5/$D$4,0)","v":5.8222313927999991},{"$f":"IF(E23>0,($B$13*E23*$B$6/1000)*$E$5/$E$4,0)","v":5.4322931255652174},{"$f":"IF(F23>0,($B$13*F23*$B$6/1000)*$F$5/$F$4,0)","v":5.7680272022822292},{"$f":"IF(G23>0,($B$13*G23*$B$6/1000)*$G$5/$G$4,0)","v":5.3845833418719211},{"$f":"IF(H23>0,($B$13*H23*$B$6/1000)*$H$5/$H$4,0)","v":5.2554416125102046},{"$f":"IF(I23>0,($B$13*I23*$B$6/1000)*$I$5/$I$4,0)","v":4.8956111666028717}]
["Leistung bei eingetragener Fläche (KW)",null,-30,{"$f":"IF(D22>0,($B$12*D22*$B$6/1000)*$D$5/$D$4,0)","v":6.283072934325002},{"$f":"IF(E22>0,($B$12*E22*$B$6/1000)*$E$5/$E$4,0)","v":5.7495281289275386},{"$f":"IF(F22>0,($B$12*F22*$B$6/1000)*$F$5/$F$4,0)","v":6.1011877602439029},{"$f":"IF(G22>0,($B$12*G22*$B$6/1000)*$G$5/$G$4,0)","v":5.7002527448275897},{"$f":"IF(H22>0,($B$12*H22*$B$6/1000)*$H$5/$H$4,0)","v":5.4669966067959193},{"$f":"IF(I22>0,($B$12*I22*$B$6/1000)*$I$5/$I$4,0)","v":4.5178086537320574}]
["Leistung bei eingetragener Fläche (KW)",null,-20,{"$f":"IF(D21>0,($B$11*D21*$B$6/1000)*$D$5/$D$4,0)","v":6.5236156575000006},{"$f":"IF(E21>0,($B$11*E21*$B$6/1000)*$E$5/$E$4,0)","v":5.9740752834782631},{"$f":"IF(F21>0,($B$11*F21*$B$6/1000)*$F$5/$F$4,0)","v":6.3372379770627179},{"$f":"IF(G21>0,($B$11*G21*$B$6/1000)*$G$5/$G$4,0)","v":5.9236152756650267},{"$f":"IF(H21>0,($B$11*H21*$B$6/1000)*$H$5/$H$4,0)","v":5.5450723255816357},{"$f":"IF(I21>0,($B$11*I21*$B$6/1000)*$I$5/$I$4,0)","v":4.1920130927004795}]
["Leistung bei eingetragener Fläche (KW)",null,-10,{"$f":"IF(D20>0,($B$10*D20*$B$6/1000)*$D$5/$D$4,0)","v":6.6282522675000015},{"$f":"IF(E20>0,($B$10*E20*$B$6/1000)*$E$5/$E$4,0)","v":6.1334286840579706},{"$f":"IF(F20>0,($B$10*F20*$B$6/1000)*$F$5/$F$4,0)","v":6.5049837961672479},{"$f":"IF(G20>0,($B$10*G20*$B$6/1000)*$G$5/$G$4,0)","v":6.0820520197044337},{"$f":"IF(H20>0,($B$10*H20*$B$6/1000)*$H$5/$H$4,0)","v":5.6228795265612268},{"$f":"IF(I20>0,($B$10*I20*$B$6/1000)*$I$5/$I$4,0)","v":4.0912037846889948}]
["Leistung bei eingetragener Fläche (KW)",null,0,{"$f":"IF(D19>0,($B$9*D19*$B$6/1000)*$D$5/$D$4,0)","v":6.6523991775000022},{"$f":"IF(E19>0,($B$9*E19*$B$6/1000)*$E$5/$E$4,0)","v":6.1562769623188416},{"$f":"IF(F19>0,($B$9*F19*$B$6/1000)*$F$5/$F$4,0)","v":6.5289222533101032},{"$f":"IF(G19>0,($B$9*G19*$B$6/1000)*$G$5/$G$4,0)","v":6.1048063842364551},{"$f":"IF(H19>0,($B$9*H19*$B$6/1000)*$H$5/$H$4,0)","v":5.5849851826530639},{"$f":"IF(I19>0,($B$9*I19*$B$6/1000)*$I$5/$I$4,0)","v":4.1051473150239239}]
["Leistung bei eingetragener Fläche (KW)",null,10,{"$f":"IF(D20>0,($B$10*D20*$B$6/1000)*$D$5/$D$4,0)","v":6.6282522675000015},{"$f":"IF(E20>0,($B$10*E20*$B$6/1000)*$E$5/$E$4,0)","v":6.1334286840579706},{"$f":"IF(F20>0,($B$10*F20*$B$6/1000)*$F$5/$F$4,0)","v":6.5049837961672479},{"$f":"IF(G20>0,($B$10*G20*$B$6/1000)*$G$5/$G$4,0)","v":6.0820520197044337},{"$f":"IF(H20>0,($B$10*H20*$B$6/1000)*$H$5/$H$4,0)","v":5.6228795265612268},{"$f":"IF(I20>0,($B$10*I20*$B$6/1000)*$I$5/$I$4,0)","v":4.0912037846889948}]
["Leistung bei eingetragener Fläche (KW)",null,20,{"$f":"IF(D21>0,($B$11*D21*$B$6/1000)*$D$5/$D$4,0)","v":6.5236156575000006},{"$f":"IF(E21>0,($B$11*E21*$B$6/1000)*$E$5/$E$4,0)","v":5.9740752834782631},{"$f":"IF(F21>0,($B$11*F21*$B$6/1000)*$F$5/$F$4,0)","v":6.3372379770627179},{"$f":"IF(G21>0,($B$11*G21*$B$6/1000)*$G$5/$G$4,0)","v":5.9236152756650267},{"$f":"IF(H21>0,($B$11*H21*$B$6/1000)*$H$5/$H$4,0)","v":5.5450723255816357},{"$f":"IF(I21>0,($B$11*I21*$B$6/1000)*$I$5/$I$4,0)","v":4.1920130927004795}]
["Leistung bei eingetragener Fläche (KW)",null,30,{"$f":"IF(D22>0,($B$12*D22*$B$6/1000)*$D$5/$D$4,0)","v":6.283072934325002},{"$f":"IF(E22>0,($B$12*E22*$B$6/1000)*$E$5/$E$4,0)","v":5.7495281289275386},{"$f":"IF(F22>0,($B$12*F22*$B$6/1000)*$F$5/$F$4,0)","v":6.1011877602439029},{"$f":"IF(G22>0,($B$12*G22*$B$6/1000)*$G$5/$G$4,0)","v":5.7002527448275897},{"$f":"IF(H22>0,($B$12*H22*$B$6/1000)*$H$5/$H$4,0)","v":5.4669966067959193},{"$f":"IF(I22>0,($B$12*I22*$B$6/1000)*$I$5/$I$4,0)","v":4.5178086537320574}]
["Leistung bei eingetragener Fläche (KW)",null,40,{"$f":"IF(D23>0,($B$13*D23*$B$6/1000)*$D$5/$D$4,0)","v":5.8222313927999991},{"$f":"IF(E23>0,($B$13*E23*$B$6/1000)*$E$5/$E$4,0)","v":5.4322931255652174},{"$f":"IF(F23>0,($B$13*F23*$B$6/1000)*$F$5/$F$4,0)","v":5.7680272022822292},{"$f":"IF(G23>0,($B$13*G23*$B$6/1000)*$G$5/$G$4,0)","v":5.3845833418719211},{"$f":"IF(H23>0,($B$13*H23*$B$6/1000)*$H$5/$H$4,0)","v":5.2554416125102046},{"$f":"IF(I23>0,($B$13*I23*$B$6/1000)*$I$5/$I$4,0)","v":4.8956111666028717}]
["Leistung bei eingetragener Fläche (KW)",null,50,{"$f":"IF(D24>0,($B$14*D24*$B$6/1000)*$D$5/$D$4,0)","v":5.2848031564500006},{"$f":"IF(E24>0,($B$14*E24*$B$6/1000)*$E$5/$E$4,0)","v":4.8705320644637684},{"$f":"IF(F24>0,($B$14*F24*$B$6/1000)*$F$5/$F$4,0)","v":5.177095196968641},{"$f":"IF(G24>0,($B$14*G24*$B$6/1000)*$G$5/$G$4,0)","v":4.8772558226600999},{"$f":"IF(H24>0,($B$14*H24*$B$6/1000)*$H$5/$H$4,0)","v":4.729939303000001},{"$f":"IF(I24>0,($B$14*I24*$B$6/1000)*$I$5/$I$4,0)","v":4.7739037615311011}]
["Leistung bei eingetragener Fläche (KW)",null,60,{"$f":"IF(D25>0,($B$15*D25*$B$6/1000)*$D$5/$D$4,0)","v":4.2881856532500002},{"$f":"IF(E25>0,($B$15*E25*$B$6/1000)*$E$5/$E$4,0)","v":4.1217711860869581},{"$f":"IF(F25>0,($B$15*F25*$B$6/1000)*$F$5/$F$4,0)","v":4.3894518394076654},{"$f":"IF(G25>0,($B$15*G25*$B$6/1000)*$G$5/$G$4,0)","v":4.0812797083743853},{"$f":"IF(H25>0,($B$15*H25*$B$6/1000)*$H$5/$H$4,0)","v":4.5762378589285708},{"$f":"IF(I25>0,($B$15*I25*$B$6/1000)*$I$5/$I$4,0)","v":4.2116785873645934}]
["Leistung bei eingetragener Fläche (KW)",null,70,{"$f":"IF(D26>0,($B$16*D26*$B$6/1000)*$D$5/$D$4,0)","v":2.9760120075750005},{"$f":"IF(E26>0,($B$16*E26*$B$6/1000)*$E$5/$E$4,0)","v":2.9753018249275365},{"$f":"IF(F26>0,($B$16*F26*$B$6/1000)*$F$5/$F$4,0)","v":3.220144328038328},{"$f":"IF(G26>0,($B$16*G26*$B$6/1000)*$G$5/$G$4,0)","v":2.9789160756650261},{"$f":"IF(H26>0,($B$16*H26*$B$6/1000)*$H$5/$H$4,0)","v":4.2051110657755109},{"$f":"IF(I26>0,($B$16*I26*$B$6/1000)*$I$5/$I$4,0)","v":2.9057995280210531}]
["KW Schnitt  > ",null,null,{"$f":"SUM(D28:D42)/15","v":5.4843163544200006},5.1113425038222244,5.4350118969101038,5.0773810907848951,5.092556118730613,4.2187456309537472]
["KWH gesamt bei Azimut -70 bis +70 > ",null,null,{"$f":"IF(D43>0,D43*$B$17,0)","v":32.357466491078007},30.156920772551125,32.066570191769614,29.956548435630882,30.046081100510619,24.89059922262711]
["Puffervolumen (L) > ",{"$f":"Eingaben!B7","v":1500},"Erwärmung (K)>",{"$f":"IF(D44>0,D44/(($B$45/1000)*1*1.163),0)","v":18.548275431973636},{"$f":"IF(E44>0,E44/(($B$45/1000)*1*1.163),0)","v":17.286856275466395},18.381524902132195,17.171996810335845,17.223319633425405,14.268041973417661]
["Laufzeit gesamt (Std.) > ",{"$f":"B17","v":5.9},{"$f":"\"Berechnung nach Tagesverlauf bei leichter Bewölkung (mit IAM) mit Diff. \"&B5&\"  bei  \"&B6&\" m²\"&\"  am \"","v":"Berechnung nach Tagesverlauf bei leichter Bewölkung (mit IAM) mit Diff. 35  bei  10,46 m²  am "},null,null,null,null,{"$f":"H17","v":"2013-06-21"}]
["Wirkungsgrad bei  Diff.0  > ",null,null,{"$f":"$D$6-$D$7*(0/1000)-$D$8*1000*((0/1000*0/1000))","v":0.81},{"$f":"$E$6-$E$7*(0/1000)-$E$8*1000*((0/1000*0/1000))","v":0.78500000000000003},{"$f":"$F$6-$F$7*(0/1000)-$F$8*1000*((0/1000*0/1000))","v":0.82},{"$f":"$G$6-$G$7*(0/1000)-$G$8*1000*((0/1000*0/1000))","v":0.8},{"$f":"$H$6-$H$7*(0/1000)-$H$8*1000*((0/1000*0/1000))","v":0.64},{"$f":"$I$6-$I$7*(0/1000)-$I$8*1000*((0/1000*0/1000))","v":0.65400000000000003}]
["Wirkungsgrad bei eingestellter Diff. bei   0° >",null,null,{"$f":"IF(Eingaben!L68>0,($D$6-$D$7*($B$5/Eingaben!L68)-$D$8*Eingaben!L68*(($B$5/Eingaben!L68*$B$5/Eingaben!L68)))*$D$9,0)","v":0.62890231621349457},{"$f":"IF(Eingaben!L68>0,($E$6-$E$7*($B$5/Eingaben!L68)-$E$8*Eingaben!L68*(($B$5/Eingaben!L68*$B$5/Eingaben!L68)))*$E$9,0)","v":0.59034407519301779},{"$f":"IF(Eingaben!L68>0,($F$6-$F$7*($B$5/Eingaben!L68)-$F$8*Eingaben!L68*(($B$5/Eingaben!L68*$B$5/Eingaben!L68)))*$F$9,0)","v":0.62755287009063432},{"$f":"IF(Eingaben!L68>0,($G$6-$G$7*($B$5/Eingaben!L68)-$G$8*Eingaben!L68*(($B$5/Eingaben!L68*$B$5/Eingaben!L68)))*$G$9,0)","v":0.59791876468613625},{"$f":"IF(Eingaben!L68>0,($H$6-$H$7*($B$5/Eingaben!L68)-$H$8*Eingaben!L68*(($B$5/Eingaben!L68*$B$5/Eingaben!L68)))*$H$9,0)","v":0.59657603222557909},{"$f":"IF(Eingaben!L68>0,($I$6-$I$7*($B$5/Eingaben!L68)-$I$8*Eingaben!L68*(($B$5/Eingaben!L68*$B$5/Eingaben!L68)))*$I$9,0)","v":0.55761195031889899}]
["Wirkungsgrad bei eingestellter Diff. bei 10° >",null,null,{"$f":"IF(Eingaben!L69>0,($D$6-$D$7*($B$5/Eingaben!L69)-$D$8*Eingaben!L69*(($B$5/Eingaben!L69*$B$5/Eingaben!L69)))*$D$10,0)","v":0.62835353535353533},{"$f":"IF(Eingaben!L69>0,($E$6-$E$7*($B$5/Eingaben!L69)-$E$8*Eingaben!L69*(($B$5/Eingaben!L69*$B$5/Eingaben!L69)))*$E$10,0)","v":0.58975420875420881},{"$f":"IF(Eingaben!L69>0,($F$6-$F$7*($B$5/Eingaben!L69)-$F$8*Eingaben!L69*(($B$5/Eingaben!L69*$B$5/Eingaben!L69)))*$F$10,0)","v":0.62696969696969695},{"$f":"IF(Eingaben!L69>0,($G$6-$G$7*($B$5/Eingaben!L69)-$G$8*Eingaben!L69*(($B$5/Eingaben!L69*$B$5/Eingaben!L69)))*$G$10,0)","v":0.59730639730639734},{"$f":"IF(Eingaben!L69>0,($H$6-$H$7*($B$5/Eingaben!L69)-$H$8*Eingaben!L69*(($B$5/Eingaben!L69*$B$5/Eingaben!L69)))*$H$10,0)","v":0.60240888888888888},{"$f":"IF(Eingaben!L69>0,($I$6-$I$7*($B$5/Eingaben!L69)-$I$8*Eingaben!L69*(($B$5/Eingaben!L69*$B$5/Eingaben!L69)))*$I$10,0)","v":0.55731986531986544}]
["Wirkungsgrad bei eingestellter Diff. bei 20° >",null,null,{"$f":"IF(Eingaben!L70>0,($D$6-$D$7*($B$5/Eingaben!L70)-$D$8*Eingaben!L70*(($B$5/Eingaben!L70*$B$5/Eingaben!L70)))*$D$11,0)","v":0.62593654042988744},{"$f":"IF(Eingaben!L70>0,($E$6-$E$7*($B$5/Eingaben!L70)-$E$8*Eingaben!L70*(($B$5/Eingaben!L70*$B$5/Eingaben!L70)))*$E$11,0)","v":0.58128469805527128},{"$f":"IF(Eingaben!L70>0,($F$6-$F$7*($B$5/Eingaben!L70)-$F$8*Eingaben!L70*(($B$5/Eingaben!L70*$B$5/Eingaben!L70)))*$F$11,0)","v":0.6181572159672466},{"$f":"IF(Eingaben!L70>0,($G$6-$G$7*($B$5/Eingaben!L70)-$G$8*Eingaben!L70*(($B$5/Eingaben!L70*$B$5/Eingaben!L70)))*$G$11,0)","v":0.58866325486182192},{"$f":"IF(Eingaben!L70>0,($H$6-$H$7*($B$5/Eingaben!L70)-$H$8*Eingaben!L70*(($B$5/Eingaben!L70*$B$5/Eingaben!L70)))*$H$11,0)","v":0.60182354145342898},{"$f":"IF(Eingaben!L70>0,($I$6-$I$7*($B$5/Eingaben!L70)-$I$8*Eingaben!L70*(($B$5/Eingaben!L70*$B$5/Eingaben!L70)))*$I$11,0)","v":0.57827477311497788}]
["Wirkungsgrad bei eingestellter Diff. bei 30° >",null,null,{"$f":"IF(Eingaben!L71>0,($D$6-$D$7*($B$5/Eingaben!L71)-$D$8*Eingaben!L71*(($B$5/Eingaben!L71*$B$5/Eingaben!L71)))*$D$12,0)","v":0.61547937172774869},{"$f":"IF(Eingaben!L71>0,($E$6-$E$7*($B$5/Eingaben!L71)-$E$8*Eingaben!L71*(($B$5/Eingaben!L71*$B$5/Eingaben!L71)))*$E$12,0)","v":0.5709466317626527},{"$f":"IF(Eingaben!L71>0,($F$6-$F$7*($B$5/Eingaben!L71)-$F$8*Eingaben!L71*(($B$5/Eingaben!L71*$B$5/Eingaben!L71)))*$F$12,0)","v":0.60749738219895277},{"$f":"IF(Eingaben!L71>0,($G$6-$G$7*($B$5/Eingaben!L71)-$G$8*Eingaben!L71*(($B$5/Eingaben!L71*$B$5/Eingaben!L71)))*$G$12,0)","v":0.57808027923211169},{"$f":"IF(Eingaben!L71>0,($H$6-$H$7*($B$5/Eingaben!L71)-$H$8*Eingaben!L71*(($B$5/Eingaben!L71*$B$5/Eingaben!L71)))*$H$12,0)","v":0.60674513089005233},{"$f":"IF(Eingaben!L71>0,($I$6-$I$7*($B$5/Eingaben!L71)-$I$8*Eingaben!L71*(($B$5/Eingaben!L71*$B$5/Eingaben!L71)))*$I$12,0)","v":0.63684310645724251}]
["Wirkungsgrad bei eingestellter Diff. bei 40° >",null,null,{"$f":"IF(Eingaben!L72>0,($D$6-$D$7*($B$5/Eingaben!L72)-$D$8*Eingaben!L72*(($B$5/Eingaben!L72*$B$5/Eingaben!L72)))*$D$13,0)","v":0.58995130434782617},{"$f":"IF(Eingaben!L72>0,($E$6-$E$7*($B$5/Eingaben!L72)-$E$8*Eingaben!L72*(($B$5/Eingaben!L72*$B$5/Eingaben!L72)))*$E$13,0)","v":0.55765159420289856},{"$f":"IF(Eingaben!L72>0,($F$6-$F$7*($B$5/Eingaben!L72)-$F$8*Eingaben!L72*(($B$5/Eingaben!L72*$B$5/Eingaben!L72)))*$F$13,0)","v":0.59391413043478247},{"$f":"IF(Eingaben!L72>0,($G$6-$G$7*($B$5/Eingaben!L72)-$G$8*Eingaben!L72*(($B$5/Eingaben!L72*$B$5/Eingaben!L72)))*$G$13,0)","v":0.56442753623188402},{"$f":"IF(Eingaben!L72>0,($H$6-$H$7*($B$5/Eingaben!L72)-$H$8*Eingaben!L72*(($B$5/Eingaben!L72*$B$5/Eingaben!L72)))*$H$13,0)","v":0.60499304347826077},{"$f":"IF(Eingaben!L72>0,($I$6-$I$7*($B$5/Eingaben!L72)-$I$8*Eingaben!L72*(($B$5/Eingaben!L72*$B$5/Eingaben!L72)))*$I$13,0)","v":0.71495289855072475}]
["Wirkungsgrad bei eingestellter Diff. bei 50° >",null,null,{"$f":"IF(Eingaben!L73>0,($D$6-$D$7*($B$5/Eingaben!L73)-$D$8*Eingaben!L73*(($B$5/Eingaben!L73*$B$5/Eingaben!L73)))*$D$14,0)","v":0.56597780346820803},{"$f":"IF(Eingaben!L73>0,($E$6-$E$7*($B$5/Eingaben!L73)-$E$8*Eingaben!L73*(($B$5/Eingaben!L73*$B$5/Eingaben!L73)))*$E$14,0)","v":0.52784712909441234},{"$f":"IF(Eingaben!L73>0,($F$6-$F$7*($B$5/Eingaben!L73)-$F$8*Eingaben!L73*(($B$5/Eingaben!L73*$B$5/Eingaben!L73)))*$F$14,0)","v":0.56313063583815026},{"$f":"IF(Eingaben!L73>0,($G$6-$G$7*($B$5/Eingaben!L73)-$G$8*Eingaben!L73*(($B$5/Eingaben!L73*$B$5/Eingaben!L73)))*$G$14,0)","v":0.53961464354527933},{"$f":"IF(Eingaben!L73>0,($H$6-$H$7*($B$5/Eingaben!L73)-$H$8*Eingaben!L73*(($B$5/Eingaben!L73*$B$5/Eingaben!L73)))*$H$14,0)","v":0.57834728323699414},{"$f":"IF(Eingaben!L73>0,($I$6-$I$7*($B$5/Eingaben!L73)-$I$8*Eingaben!L73*(($B$5/Eingaben!L73*$B$5/Eingaben!L73)))*$I$14,0)","v":0.73895429672447022}]
["Wirkungsgrad bei eingestellter Diff. bei 60° >",null,null,{"$f":"IF(Eingaben!L74>0,($D$6-$D$7*($B$5/Eingaben!L74)-$D$8*Eingaben!L74*(($B$5/Eingaben!L74*$B$5/Eingaben!L74)))*$D$15,0)","v":0.49983944020356241},{"$f":"IF(Eingaben!L74>0,($E$6-$E$7*($B$5/Eingaben!L74)-$E$8*Eingaben!L74*(($B$5/Eingaben!L74*$B$5/Eingaben!L74)))*$E$15,0)","v":0.48517175572519095},{"$f":"IF(Eingaben!L74>0,($F$6-$F$7*($B$5/Eingaben!L74)-$F$8*Eingaben!L74*(($B$5/Eingaben!L74*$B$5/Eingaben!L74)))*$F$15,0)","v":0.51918320610687019},{"$f":"IF(Eingaben!L74>0,($G$6-$G$7*($B$5/Eingaben!L74)-$G$8*Eingaben!L74*(($B$5/Eingaben!L74*$B$5/Eingaben!L74)))*$G$15,0)","v":0.49022900763358784},{"$f":"IF(Eingaben!L74>0,($H$6-$H$7*($B$5/Eingaben!L74)-$H$8*Eingaben!L74*(($B$5/Eingaben!L74*$B$5/Eingaben!L74)))*$H$15,0)","v":0.61439694656488542},{"$f":"IF(Eingaben!L74>0,($I$6-$I$7*($B$5/Eingaben!L74)-$I$8*Eingaben!L74*(($B$5/Eingaben!L74*$B$5/Eingaben!L74)))*$I$15,0)","v":0.71318459711620019}]
["Wirkungsgrad bei eingestellter Diff. bei 70° >",null,null,{"$f":"IF(Eingaben!L75>0,($D$6-$D$7*($B$5/Eingaben!L75)-$D$8*Eingaben!L75*(($B$5/Eingaben!L75*$B$5/Eingaben!L75)))*$D$16,0)","v":0.39623922734026751},{"$f":"IF(Eingaben!L75>0,($E$6-$E$7*($B$5/Eingaben!L75)-$E$8*Eingaben!L75*(($B$5/Eingaben!L75*$B$5/Eingaben!L75)))*$E$16,0)","v":0.39823080733036165},{"$f":"IF(Eingaben!L75>0,($F$6-$F$7*($B$5/Eingaben!L75)-$F$8*Eingaben!L75*(($B$5/Eingaben!L75*$B$5/Eingaben!L75)))*$F$16,0)","v":0.43419851411589894},{"$f":"IF(Eingaben!L75>0,($G$6-$G$7*($B$5/Eingaben!L75)-$G$8*Eingaben!L75*(($B$5/Eingaben!L75*$B$5/Eingaben!L75)))*$G$16,0)","v":0.40648439821693921},{"$f":"IF(Eingaben!L75>0,($H$6-$H$7*($B$5/Eingaben!L75)-$H$8*Eingaben!L75*(($B$5/Eingaben!L75*$B$5/Eingaben!L75)))*$H$16,0)","v":0.65655869242199105},{"$f":"IF(Eingaben!L75>0,($I$6-$I$7*($B$5/Eingaben!L75)-$I$8*Eingaben!L75*(($B$5/Eingaben!L75*$B$5/Eingaben!L75)))*$I$16,0)","v":0.56807699851411597}]
["Leistung nach Tagesverlauf  ",null,"Azimut",{"$f":"D27","v":"SolRose 26"},{"$f":"E27","v":"Synergie 210"},"Sunex AMX 2,85","Sunex 2,0","Star Azzurro CPC","Billig VRK"]
["Leistung bei eingetragener Fläche (KW)",null,-70,{"$f":"IF(D55>0,(Eingaben!L75*D55*$B$6/1000)*$D$5/$D$4,0)","v":1.9874173897500005},{"$f":"IF(E55>0,(Eingaben!L75*E55*$B$6/1000)*$E$5/$E$4,0)","v":1.9501757402898559},{"$f":"IF(F55>0,(Eingaben!L75*F55*$B$6/1000)*$F$5/$F$4,0)","v":2.1326800661811851},{"$f":"IF(G55>0,(Eingaben!L75*G55*$B$6/1000)*$G$5/$G$4,0)","v":1.9452421808867011},{"$f":"IF(H55>0,(Eingaben!L75*H55*$B$6/1000)*$H$5/$H$4,0)","v":3.0684918590816337},{"$f":"IF(I55>0,(Eingaben!L75*I55*$B$6/1000)*$I$5/$I$4,0)","v":2.0377799058459338}]
["Leistung bei eingetragener Fläche (KW)",null,-60,{"$f":"IF(D54>0,(Eingaben!L74*D54*$B$6/1000)*$D$5/$D$4,0)","v":2.9279902129500006},{"$f":"IF(E54>0,(Eingaben!L74*E54*$B$6/1000)*$E$5/$E$4,0)","v":2.7748651826086967},{"$f":"IF(F54>0,(Eingaben!L74*F54*$B$6/1000)*$F$5/$F$4,0)","v":2.9782797908362366},{"$f":"IF(G54>0,(Eingaben!L74*G54*$B$6/1000)*$G$5/$G$4,0)","v":2.739909919211823},{"$f":"IF(H54>0,(Eingaben!L74*H54*$B$6/1000)*$H$5/$H$4,0)","v":3.3535744360714288},{"$f":"IF(I54>0,(Eingaben!L74*I54*$B$6/1000)*$I$5/$I$4,0)","v":2.9878549298679431}]
["Leistung bei eingetragener Fläche (KW)",null,-50,{"$f":"IF(D53>0,(Eingaben!L73*D53*$B$6/1000)*$D$5/$D$4,0)","v":3.6486487796999998},{"$f":"IF(E53>0,(Eingaben!L73*E53*$B$6/1000)*$E$5/$E$4,0)","v":3.322370809971015},{"$f":"IF(F53>0,(Eingaben!L73*F53*$B$6/1000)*$F$5/$F$4,0)","v":3.5550652383972126},{"$f":"IF(G53>0,(Eingaben!L73*G53*$B$6/1000)*$G$5/$G$4,0)","v":3.3190559014778329},{"$f":"IF(H53>0,(Eingaben!L73*H53*$B$6/1000)*$H$5/$H$4,0)","v":3.4740907830000003},{"$f":"IF(I53>0,(Eingaben!L73*I53*$B$6/1000)*$I$5/$I$4,0)","v":3.4069730043636368}]
["Leistung bei eingetragener Fläche (KW)",null,-40,{"$f":"IF(D52>0,(Eingaben!L72*D52*$B$6/1000)*$D$5/$D$4,0)","v":4.0450188168000007},{"$f":"IF(E52>0,(Eingaben!L72*E52*$B$6/1000)*$E$5/$E$4,0)","v":3.7331428322318843},{"$f":"IF(F52>0,(Eingaben!L72*F52*$B$6/1000)*$F$5/$F$4,0)","v":3.9878039394250866},{"$f":"IF(G52>0,(Eingaben!L72*G52*$B$6/1000)*$G$5/$G$4,0)","v":3.6924170995073897},{"$f":"IF(H52>0,(Eingaben!L72*H52*$B$6/1000)*$H$5/$H$4,0)","v":3.8652230786326531},{"$f":"IF(I52>0,(Eingaben!L72*I52*$B$6/1000)*$I$5/$I$4,0)","v":3.5059059765550247}]
["Leistung bei eingetragener Fläche (KW)",null,-30,{"$f":"IF(D51>0,(Eingaben!L71*D51*$B$6/1000)*$D$5/$D$4,0)","v":4.3805982627000004},{"$f":"IF(E51>0,(Eingaben!L71*E51*$B$6/1000)*$E$5/$E$4,0)","v":3.9675528268985518},{"$f":"IF(F51>0,(Eingaben!L71*F51*$B$6/1000)*$F$5/$F$4,0)","v":4.2341875902439021},{"$f":"IF(G51>0,(Eingaben!L71*G51*$B$6/1000)*$G$5/$G$4,0)","v":3.9256019310344836},{"$f":"IF(H51>0,(Eingaben!L71*H51*$B$6/1000)*$H$5/$H$4,0)","v":4.0238893243469391},{"$f":"IF(I51>0,(Eingaben!L71*I51*$B$6/1000)*$I$5/$I$4,0)","v":3.2416851378708134}]
["Leistung bei eingetragener Fläche (KW)",null,-20,{"$f":"IF(D50>0,(Eingaben!L70*D50*$B$6/1000)*$D$5/$D$4,0)","v":4.5576547349999998},{"$f":"IF(E50>0,(Eingaben!L70*E50*$B$6/1000)*$E$5/$E$4,0)","v":4.1324469349565227},{"$f":"IF(F50>0,(Eingaben!L70*F50*$B$6/1000)*$F$5/$F$4,0)","v":4.4077384852055745},{"$f":"IF(G50>0,(Eingaben!L70*G50*$B$6/1000)*$G$5/$G$4,0)","v":4.0895566084729076},{"$f":"IF(H50>0,(Eingaben!L70*H50*$B$6/1000)*$H$5/$H$4,0)","v":4.0831947225612266},{"$f":"IF(I50>0,(Eingaben!L70*I50*$B$6/1000)*$I$5/$I$4,0)","v":3.0113679008076559}]
["Leistung bei eingetragener Fläche (KW)",null,-10,{"$f":"IF(D49>0,(Eingaben!L69*D49*$B$6/1000)*$D$5/$D$4,0)","v":4.6361321925000007},{"$f":"IF(E49>0,(Eingaben!L69*E49*$B$6/1000)*$E$5/$E$4,0)","v":4.2484457275362333},{"$f":"IF(F49>0,(Eingaben!L69*F49*$B$6/1000)*$F$5/$F$4,0)","v":4.5300610818815326},{"$f":"IF(G49>0,(Eingaben!L69*G49*$B$6/1000)*$G$5/$G$4,0)","v":4.2048169458128086},{"$f":"IF(H49>0,(Eingaben!L69*H49*$B$6/1000)*$H$5/$H$4,0)","v":4.1415501232959198},{"$f":"IF(I49>0,(Eingaben!L69*I49*$B$6/1000)*$I$5/$I$4,0)","v":2.9408625320574169}]
["Leistung bei eingetragener Fläche (KW)",null,0,{"$f":"IF(D48>0,(Eingaben!L68*D48*$B$6/1000)*$D$5/$D$4,0)","v":4.6542423750000008},{"$f":"IF(E48>0,(Eingaben!L68*E48*$B$6/1000)*$E$5/$E$4,0)","v":4.2655819362318841},{"$f":"IF(F48>0,(Eingaben!L68*F48*$B$6/1000)*$F$5/$F$4,0)","v":4.5480149247386752},{"$f":"IF(G48>0,(Eingaben!L68*G48*$B$6/1000)*$G$5/$G$4,0)","v":4.2218827192118225},{"$f":"IF(H48>0,(Eingaben!L68*H48*$B$6/1000)*$H$5/$H$4,0)","v":4.1138779744897969},{"$f":"IF(I48>0,(Eingaben!L68*I48*$B$6/1000)*$I$5/$I$4,0)","v":2.9513201798086128}]
["Leistung bei eingetragener Fläche (KW)",null,10,{"$f":"IF(D49>0,(Eingaben!L69*D49*$B$6/1000)*$D$5/$D$4,0)","v":4.6361321925000007},{"$f":"IF(E49>0,(Eingaben!L69*E49*$B$6/1000)*$E$5/$E$4,0)","v":4.2484457275362333},{"$f":"IF(F49>0,(Eingaben!L69*F49*$B$6/1000)*$F$5/$F$4,0)","v":4.5300610818815326},{"$f":"IF(G49>0,(Eingaben!L69*G49*$B$6/1000)*$G$5/$G$4,0)","v":4.2048169458128086},{"$f":"IF(H49>0,(Eingaben!L69*H49*$B$6/1000)*$H$5/$H$4,0)","v":4.1415501232959198},{"$f":"IF(I49>0,(Eingaben!L69*I49*$B$6/1000)*$I$5/$I$4,0)","v":2.9408625320574169}]
["Leistung bei eingetragener Fläche (KW)",null,20,{"$f":"IF(D50>0,(Eingaben!L70*D50*$B$6/1000)*$D$5/$D$4,0)","v":4.5576547349999998},{"$f":"IF(E50>0,(Eingaben!L70*E50*$B$6/1000)*$E$5/$E$4,0)","v":4.1324469349565227},{"$f":"IF(F50>0,(Eingaben!L70*F50*$B$6/1000)*$F$5/$F$4,0)","v":4.4077384852055745},{"$f":"IF(G50>0,(Eingaben!L70*G50*$B$6/1000)*$G$5/$G$4,0)","v":4.0895566084729076},{"$f":"IF(H50>0,(Eingaben!L70*H50*$B$6/1000)*$H$5/$H$4,0)","v":4.0831947225612266},{"$f":"IF(I50>0,(Eingaben!L70*I50*$B$6/1000)*$I$5/$I$4,0)","v":3.0113679008076559}]
["Leistung bei eingetragener Fläche (KW)",null,30,{"$f":"IF(D51>0,(Eingaben!L71*D51*$B$6/1000)*$D$5/$D$4,0)","v":4.3805982627000004},{"$f":"IF(E51>0,(Eingaben!L71*E51*$B$6/1000)*$E$5/$E$4,0)","v":3.9675528268985518},{"$f":"IF(F51>0,(Eingaben!L71*F51*$B$6/1000)*$F$5/$F$4,0)","v":4.2341875902439021},{"$f":"IF(G51>0,(Eingaben!L71*G51*$B$6/1000)*$G$5/$G$4,0)","v":3.9256019310344836},{"$f":"IF(H51>0,(Eingaben!L71*H51*$B$6/1000)*$H$5/$H$4,0)","v":4.0238893243469391},{"$f":"IF(I51>0,(Eingaben!L71*I51*$B$6/1000)*$I$5/$I$4,0)","v":3.2416851378708134}]
["Leistung bei eingetragener Fläche (KW)",null,40,{"$f":"IF(D52>0,(Eingaben!L72*D52*$B$6/1000)*$D$5/$D$4,0)","v":4.0450188168000007},{"$f":"IF(E52>0,(Eingaben!L72*E52*$B$6/1000)*$E$5/$E$4,0)","v":3.7331428322318843},{"$f":"IF(F52>0,(Eingaben!L72*F52*$B$6/1000)*$F$5/$F$4,0)","v":3.9878039394250866},{"$f":"IF(G52>0,(Eingaben!L72*G52*$B$6/1000)*$G$5/$G$4,0)","v":3.6924170995073897},{"$f":"IF(H52>0,(Eingaben!L72*H52*$B$6/1000)*$H$5/$H$4,0)","v":3.8652230786326531},{"$f":"IF(I52>0,(Eingaben!L72*I52*$B$6/1000)*$I$5/$I$4,0)","v":3.5059059765550247}]
["Leistung bei eingetragener Fläche (KW)",null,50,{"$f":"IF(D53>0,(Eingaben!L73*D53*$B$6/1000)*$D$5/$D$4,0)","v":3.6486487796999998},{"$f":"IF(E53>0,(Eingaben!L73*E53*$B$6/1000)*$E$5/$E$4,0)","v":3.322370809971015},{"$f":"IF(F53>0,(Eingaben!L73*F53*$B$6/1000)*$F$5/$F$4,0)","v":3.5550652383972126},{"$f":"IF(G53>0,(Eingaben!L73*G53*$B$6/1000)*$G$5/$G$4,0)","v":3.3190559014778329},{"$f":"IF(H53>0,(Eingaben!L73*H53*$B$6/1000)*$H$5/$H$4,0)","v":3.4740907830000003},{"$f":"IF(I53>0,(Eingaben!L73*I53*$B$6/1000)*$I$5/$I$4,0)","v":3.4069730043636368}]
["Leistung bei eingetragener Fläche (KW)",null,60,{"$f":"IF(D54>0,(Eingaben!L74*D54*$B$6/1000)*$D$5/$D$4,0)","v":2.9279902129500006},{"$f":"IF(E54>0,(Eingaben!L74*E54*$B$6/1000)*$E$5/$E$4,0)","v":2.7748651826086967},{"$f":"IF(F54>0,(Eingaben!L74*F54*$B$6/1000)*$F$5/$F$4,0)","v":2.9782797908362366},{"$f":"IF(G54>0,(Eingaben!L74*G54*$B$6/1000)*$G$5/$G$4,0)","v":2.739909919211823},{"$f":"IF(H54>0,(Eingaben!L74*H54*$B$6/1000)*$H$5/$H$4,0)","v":3.3535744360714288},{"$f":"IF(I54>0,(Eingaben!L74*I54*$B$6/1000)*$I$5/$I$4,0)","v":2.9878549298679431}]
["Leistung bei eingetragener Fläche (KW)",null,70,{"$f":"IF(D55>0,(Eingaben!L75*D55*$B$6/1000)*$D$5/$D$4,0)","v":1.9874173897500005},{"$f":"IF(E55>0,(Eingaben!L75*E55*$B$6/1000)*$E$5/$E$4,0)","v":1.9501757402898559},{"$f":"IF(F55>0,(Eingaben!L75*F55*$B$6/1000)*$F$5/$F$4,0)","v":2.1326800661811851},{"$f":"IF(G55>0,(Eingaben!L75*G55*$B$6/1000)*$G$5/$G$4,0)","v":1.9452421808867011},{"$f":"IF(H55>0,(Eingaben!L75*H55*$B$6/1000)*$H$5/$H$4,0)","v":3.0684918590816337},{"$f":"IF(I55>0,(Eingaben!L75*I55*$B$6/1000)*$I$5/$I$4,0)","v":2.0377799058459338}]
["KW Schnitt  > ",null,null,{"$f":"SUM(D57:D71)/15","v":3.8014108769199999},{"$f":"SUM(E57:E71)/15","v":3.5015721363478272},3.7466431539386762,3.4703389261346471,3.7422604418979599,3.0144119303030306]
["KWH gesamt bei Azimut -70 bis +70 > ",null,null,{"$f":"IF(D72>0,D72*$B$17,0)","v":22.428324173827999},20.65927560445218,22.10519460823819,20.474999664194421,22.079336607197966,17.785030388787881]
["Puffervolumen (L) > ",{"$f":"B45","v":1500},"Erwärmung (K)>",{"$f":"IF(D73>0,D73/(($B$45/1000)*1*1.163),0)","v":12.856591673160217},{"$f":"IF(E73>0,E73/(($B$45/1000)*1*1.163),0)","v":11.842519693007842},12.671364063191854,11.736887167781267,12.656541477327583,10.19491567141753]
["Laufzeit gesamt (Std.) > ",{"$f":"B17","v":5.9},{"$f":"\"Berechnung nach Tagesverlauf bei mittlerer Bewölkung (mit IAM) mit Diff. \"&B5&\"  bei  \"&B6&\" m²\"&\"  am \"","v":"Berechnung nach Tagesverlauf bei mittlerer Bewölkung (mit IAM) mit Diff. 35  bei  10,46 m²  am "},null,null,null,null,{"$f":"H17","v":"2013-06-21"}]
["Wirkungsgrad bei  Diff.0  > ",null,null,{"$f":"$D$6-$D$7*(0/1000)-$D$8*1000*((0/1000*0/1000))","v":0.81},{"$f":"$E$6-$E$7*(0/1000)-$E$8*1000*((0/1000*0/1000))","v":0.78500000000000003},{"$f":"$F$6-$F$7*(0/1000)-$F$8*1000*((0/1000*0/1000))","v":0.82},{"$f":"$G$6-$G$7*(0/1000)-$G$8*1000*((0/1000*0/1000))","v":0.8},{"$f":"$H$6-$H$7*(0/1000)-$H$8*1000*((0/1000*0/1000))","v":0.64},{"$f":"$I$6-$I$7*(0/1000)-$I$8*1000*((0/1000*0/1000))","v":0.65400000000000003}]
["Wirkungsgrad bei eingestellter Diff. bei   0° >",null,null,{"$f":"IF(Eingaben!L110>0,($D$6-$D$7*($B$5/Eingaben!L110)-$D$8*Eingaben!L110*(($B$5/Eingaben!L110*$B$5/Eingaben!L110)))*$D$9,0)","v":0.53835347432024172},{"$f":"IF(Eingaben!L110>0,($E$6-$E$7*($B$5/Eingaben!L110)-$E$8*Eingaben!L110*(($B$5/Eingaben!L110*$B$5/Eingaben!L110)))*$E$9,0)","v":0.49301611278952662},{"$f":"IF(Eingaben!L110>0,($F$6-$F$7*($B$5/Eingaben!L110)-$F$8*Eingaben!L110*(($B$5/Eingaben!L110*$B$5/Eingaben!L110)))*$F$9,0)","v":0.53132930513595167},{"$f":"IF(Eingaben!L110>0,($G$6-$G$7*($B$5/Eingaben!L110)-$G$8*Eingaben!L110*(($B$5/Eingaben!L110*$B$5/Eingaben!L110)))*$G$9,0)","v":0.49687814702920446},{"$f":"IF(Eingaben!L110>0,($H$6-$H$7*($B$5/Eingaben!L110)-$H$8*Eingaben!L110*(($B$5/Eingaben!L110*$B$5/Eingaben!L110)))*$H$9,0)","v":0.57486404833836857},{"$f":"IF(Eingaben!L110>0,($I$6-$I$7*($B$5/Eingaben!L110)-$I$8*Eingaben!L110*(($B$5/Eingaben!L110*$B$5/Eingaben!L110)))*$I$9,0)","v":0.50941792547834841}]
["Wirkungsgrad bei eingestellter Diff. bei 10° >",null,null,{"$f":"IF(Eingaben!L111>0,($D$6-$D$7*($B$5/Eingaben!L111)-$D$8*Eingaben!L111*(($B$5/Eingaben!L111*$B$5/Eingaben!L111)))*$D$10,0)","v":0.53753030303030314},{"$f":"IF(Eingaben!L111>0,($E$6-$E$7*($B$5/Eingaben!L111)-$E$8*Eingaben!L111*(($B$5/Eingaben!L111*$B$5/Eingaben!L111)))*$E$10,0)","v":0.4921313131313132},{"$f":"IF(Eingaben!L111>0,($F$6-$F$7*($B$5/Eingaben!L111)-$F$8*Eingaben!L111*(($B$5/Eingaben!L111*$B$5/Eingaben!L111)))*$F$10,0)","v":0.5304545454545454},{"$f":"IF(Eingaben!L111>0,($G$6-$G$7*($B$5/Eingaben!L111)-$G$8*Eingaben!L111*(($B$5/Eingaben!L111*$B$5/Eingaben!L111)))*$G$10,0)","v":0.49595959595959599},{"$f":"IF(Eingaben!L111>0,($H$6-$H$7*($B$5/Eingaben!L111)-$H$8*Eingaben!L111*(($B$5/Eingaben!L111*$B$5/Eingaben!L111)))*$H$10,0)","v":0.58041333333333334},{"$f":"IF(Eingaben!L111>0,($I$6-$I$7*($B$5/Eingaben!L111)-$I$8*Eingaben!L111*(($B$5/Eingaben!L111*$B$5/Eingaben!L111)))*$I$10,0)","v":0.50897979797979809}]
["Wirkungsgrad bei eingestellter Diff. bei 20° >",null,null,{"$f":"IF(Eingaben!L112>0,($D$6-$D$7*($B$5/Eingaben!L112)-$D$8*Eingaben!L112*(($B$5/Eingaben!L112*$B$5/Eingaben!L112)))*$D$11,0)","v":0.5339048106448312},{"$f":"IF(Eingaben!L112>0,($E$6-$E$7*($B$5/Eingaben!L112)-$E$8*Eingaben!L112*(($B$5/Eingaben!L112*$B$5/Eingaben!L112)))*$E$11,0)","v":0.48335204708290685},{"$f":"IF(Eingaben!L112>0,($F$6-$F$7*($B$5/Eingaben!L112)-$F$8*Eingaben!L112*(($B$5/Eingaben!L112*$B$5/Eingaben!L112)))*$F$11,0)","v":0.52133582395086986},{"$f":"IF(Eingaben!L112>0,($G$6-$G$7*($B$5/Eingaben!L112)-$G$8*Eingaben!L112*(($B$5/Eingaben!L112*$B$5/Eingaben!L112)))*$G$11,0)","v":0.48699488229273286},{"$f":"IF(Eingaben!L112>0,($H$6-$H$7*($B$5/Eingaben!L112)-$H$8*Eingaben!L112*(($B$5/Eingaben!L112*$B$5/Eingaben!L112)))*$H$11,0)","v":0.57953531218014331},{"$f":"IF(Eingaben!L112>0,($I$6-$I$7*($B$5/Eingaben!L112)-$I$8*Eingaben!L112*(($B$5/Eingaben!L112*$B$5/Eingaben!L112)))*$I$11,0)","v":0.52733215967246683}]
["Wirkungsgrad bei eingestellter Diff. bei 30° >",null,null,{"$f":"IF(Eingaben!L113>0,($D$6-$D$7*($B$5/Eingaben!L113)-$D$8*Eingaben!L113*(($B$5/Eingaben!L113*$B$5/Eingaben!L113)))*$D$12,0)","v":0.52226905759162301},{"$f":"IF(Eingaben!L113>0,($E$6-$E$7*($B$5/Eingaben!L113)-$E$8*Eingaben!L113*(($B$5/Eingaben!L113*$B$5/Eingaben!L113)))*$E$12,0)","v":0.47176994764397912},{"$f":"IF(Eingaben!L113>0,($F$6-$F$7*($B$5/Eingaben!L113)-$F$8*Eingaben!L113*(($B$5/Eingaben!L113*$B$5/Eingaben!L113)))*$F$12,0)","v":0.50944607329842917},{"$f":"IF(Eingaben!L113>0,($G$6-$G$7*($B$5/Eingaben!L113)-$G$8*Eingaben!L113*(($B$5/Eingaben!L113*$B$5/Eingaben!L113)))*$G$12,0)","v":0.47512041884816758},{"$f":"IF(Eingaben!L113>0,($H$6-$H$7*($B$5/Eingaben!L113)-$H$8*Eingaben!L113*(($B$5/Eingaben!L113*$B$5/Eingaben!L113)))*$H$12,0)","v":0.58371769633507853},{"$f":"IF(Eingaben!L113>0,($I$6-$I$7*($B$5/Eingaben!L113)-$I$8*Eingaben!L113*(($B$5/Eingaben!L113*$B$5/Eingaben!L113)))*$I$12,0)","v":0.57921465968586394}]
["Wirkungsgrad bei eingestellter Diff. bei 40° >",null,null,{"$f":"IF(Eingaben!L114>0,($D$6-$D$7*($B$5/Eingaben!L114)-$D$8*Eingaben!L114*(($B$5/Eingaben!L114*$B$5/Eingaben!L114)))*$D$13,0)","v":0.4961269565217391},{"$f":"IF(Eingaben!L114>0,($E$6-$E$7*($B$5/Eingaben!L114)-$E$8*Eingaben!L114*(($B$5/Eingaben!L114*$B$5/Eingaben!L114)))*$E$13,0)","v":0.4557523913043478},{"$f":"IF(Eingaben!L114>0,($F$6-$F$7*($B$5/Eingaben!L114)-$F$8*Eingaben!L114*(($B$5/Eingaben!L114*$B$5/Eingaben!L114)))*$F$13,0)","v":0.49317119565217388},{"$f":"IF(Eingaben!L114>0,($G$6-$G$7*($B$5/Eingaben!L114)-$G$8*Eingaben!L114*(($B$5/Eingaben!L114*$B$5/Eingaben!L114)))*$G$13,0)","v":0.45864130434782613},{"$f":"IF(Eingaben!L114>0,($H$6-$H$7*($B$5/Eingaben!L114)-$H$8*Eingaben!L114*(($B$5/Eingaben!L114*$B$5/Eingaben!L114)))*$H$13,0)","v":0.5810895652173913},{"$f":"IF(Eingaben!L114>0,($I$6-$I$7*($B$5/Eingaben!L114)-$I$8*Eingaben!L114*(($B$5/Eingaben!L114*$B$5/Eingaben!L114)))*$I$13,0)","v":0.64732934782608698}]
["Wirkungsgrad bei eingestellter Diff. bei 50° >",null,null,{"$f":"IF(Eingaben!L115>0,($D$6-$D$7*($B$5/Eingaben!L115)-$D$8*Eingaben!L115*(($B$5/Eingaben!L115*$B$5/Eingaben!L115)))*$D$14,0)","v":0.46826670520231217},{"$f":"IF(Eingaben!L115>0,($E$6-$E$7*($B$5/Eingaben!L115)-$E$8*Eingaben!L115*(($B$5/Eingaben!L115*$B$5/Eingaben!L115)))*$E$14,0)","v":0.42282069364161851},{"$f":"IF(Eingaben!L115>0,($F$6-$F$7*($B$5/Eingaben!L115)-$F$8*Eingaben!L115*(($B$5/Eingaben!L115*$B$5/Eingaben!L115)))*$F$14,0)","v":0.45929595375722532},{"$f":"IF(Eingaben!L115>0,($G$6-$G$7*($B$5/Eingaben!L115)-$G$8*Eingaben!L115*(($B$5/Eingaben!L115*$B$5/Eingaben!L115)))*$G$14,0)","v":0.4294219653179191},{"$f":"IF(Eingaben!L115>0,($H$6-$H$7*($B$5/Eingaben!L115)-$H$8*Eingaben!L115*(($B$5/Eingaben!L115*$B$5/Eingaben!L115)))*$H$14,0)","v":0.55392092485549127},{"$f":"IF(Eingaben!L115>0,($I$6-$I$7*($B$5/Eingaben!L115)-$I$8*Eingaben!L115*(($B$5/Eingaben!L115*$B$5/Eingaben!L115)))*$I$14,0)","v":0.66371144508670532}]
["Wirkungsgrad bei eingestellter Diff. bei 60° >",null,null,{"$f":"IF(Eingaben!L116>0,($D$6-$D$7*($B$5/Eingaben!L116)-$D$8*Eingaben!L116*(($B$5/Eingaben!L116*$B$5/Eingaben!L116)))*$D$15,0)","v":0.40145916030534357},{"$f":"IF(Eingaben!L116>0,($E$6-$E$7*($B$5/Eingaben!L116)-$E$8*Eingaben!L116*(($B$5/Eingaben!L116*$B$5/Eingaben!L116)))*$E$15,0)","v":0.37450763358778627},{"$f":"IF(Eingaben!L116>0,($F$6-$F$7*($B$5/Eingaben!L116)-$F$8*Eingaben!L116*(($B$5/Eingaben!L116*$B$5/Eingaben!L116)))*$F$15,0)","v":0.40977480916030529},{"$f":"IF(Eingaben!L116>0,($G$6-$G$7*($B$5/Eingaben!L116)-$G$8*Eingaben!L116*(($B$5/Eingaben!L116*$B$5/Eingaben!L116)))*$G$15,0)","v":0.37534351145038169},{"$f":"IF(Eingaben!L116>0,($H$6-$H$7*($B$5/Eingaben!L116)-$H$8*Eingaben!L116*(($B$5/Eingaben!L116*$B$5/Eingaben!L116)))*$H$15,0)","v":0.58559541984732832},{"$f":"IF(Eingaben!L116>0,($I$6-$I$7*($B$5/Eingaben!L116)-$I$8*Eingaben!L116*(($B$5/Eingaben!L116*$B$5/Eingaben!L116)))*$I$15,0)","v":0.63159689567430033}]
["Wirkungsgrad bei eingestellter Diff. bei 70° >",null,null,{"$f":"IF(Eingaben!L117>0,($D$6-$D$7*($B$5/Eingaben!L117)-$D$8*Eingaben!L117*(($B$5/Eingaben!L117*$B$5/Eingaben!L117)))*$D$16,0)","v":0.29870884101040124},{"$f":"IF(Eingaben!L117>0,($E$6-$E$7*($B$5/Eingaben!L117)-$E$8*Eingaben!L117*(($B$5/Eingaben!L117*$B$5/Eingaben!L117)))*$E$16,0)","v":0.28334621099554236},{"$f":"IF(Eingaben!L117>0,($F$6-$F$7*($B$5/Eingaben!L117)-$F$8*Eingaben!L117*(($B$5/Eingaben!L117*$B$5/Eingaben!L117)))*$F$16,0)","v":0.3191977711738484},{"$f":"IF(Eingaben!L117>0,($G$6-$G$7*($B$5/Eingaben!L117)-$G$8*Eingaben!L117*(($B$5/Eingaben!L117*$B$5/Eingaben!L117)))*$G$16,0)","v":0.28572659732540867},{"$f":"IF(Eingaben!L117>0,($H$6-$H$7*($B$5/Eingaben!L117)-$H$8*Eingaben!L117*(($B$5/Eingaben!L117*$B$5/Eingaben!L117)))*$H$16,0)","v":0.62003803863298657},{"$f":"IF(Eingaben!L117>0,($I$6-$I$7*($B$5/Eingaben!L117)-$I$8*Eingaben!L117*(($B$5/Eingaben!L117*$B$5/Eingaben!L117)))*$I$16,0)","v":0.48914549777117394}]
["Leistung nach Tagesverlauf  ",null,"Azimut",{"$f":"D27","v":"SolRose 26"},{"$f":"E27","v":"Synergie 210"},"Sunex AMX 2,85","Sunex 2,0","Star Azzurro CPC","Billig VRK"]
["Leistung bei eingetragener Fläche (KW)",null,-70,{"$f":"IF(D84>0,(Eingaben!L117*D84*$B$6/1000)*$D$5/$D$4,0)","v":0.99882277192500035},{"$f":"IF(E84>0,(Eingaben!L117*E84*$B$6/1000)*$E$5/$E$4,0)","v":0.92504965565217401},{"$f":"IF(F84>0,(Eingaben!L117*F84*$B$6/1000)*$F$5/$F$4,0)","v":1.0452158043240416},{"$f":"IF(G84>0,(Eingaben!L117*G84*$B$6/1000)*$G$5/$G$4,0)","v":0.91156828610837481},{"$f":"IF(H84>0,(Eingaben!L117*H84*$B$6/1000)*$H$5/$H$4,0)","v":1.9318726523877552},{"$f":"IF(I84>0,(Eingaben!L117*I84*$B$6/1000)*$I$5/$I$4,0)","v":1.1697602836708139}]
["Leistung bei eingetragener Fläche (KW)",null,-60,{"$f":"IF(D83>0,(Eingaben!L116*D83*$B$6/1000)*$D$5/$D$4,0)","v":1.5677947726500006},{"$f":"IF(E83>0,(Eingaben!L116*E83*$B$6/1000)*$E$5/$E$4,0)","v":1.4279591791304349},{"$f":"IF(F83>0,(Eingaben!L116*F83*$B$6/1000)*$F$5/$F$4,0)","v":1.5671077422648081},{"$f":"IF(G83>0,(Eingaben!L116*G83*$B$6/1000)*$G$5/$G$4,0)","v":1.3985401300492617},{"$f":"IF(H83>0,(Eingaben!L116*H83*$B$6/1000)*$H$5/$H$4,0)","v":2.1309110132142863},{"$f":"IF(I83>0,(Eingaben!L116*I83*$B$6/1000)*$I$5/$I$4,0)","v":1.7640312723712923}]
["Leistung bei eingetragener Fläche (KW)",null,-50,{"$f":"IF(D82>0,(Eingaben!L115*D82*$B$6/1000)*$D$5/$D$4,0)","v":2.0124944029500003},{"$f":"IF(E82>0,(Eingaben!L115*E82*$B$6/1000)*$E$5/$E$4,0)","v":1.7742095554782613},{"$f":"IF(F82>0,(Eingaben!L115*F82*$B$6/1000)*$F$5/$F$4,0)","v":1.9330352798257833},{"$f":"IF(G82>0,(Eingaben!L115*G82*$B$6/1000)*$G$5/$G$4,0)","v":1.7608559802955668},{"$f":"IF(H82>0,(Eingaben!L115*H82*$B$6/1000)*$H$5/$H$4,0)","v":2.218242263},{"$f":"IF(I82>0,(Eingaben!L115*I82*$B$6/1000)*$I$5/$I$4,0)","v":2.040042247196173}]
["Leistung bei eingetragener Fläche (KW)",null,-40,{"$f":"IF(D81>0,(Eingaben!L114*D81*$B$6/1000)*$D$5/$D$4,0)","v":2.2678062407999997},{"$f":"IF(E81>0,(Eingaben!L114*E81*$B$6/1000)*$E$5/$E$4,0)","v":2.0339925388985503},{"$f":"IF(F81>0,(Eingaben!L114*F81*$B$6/1000)*$F$5/$F$4,0)","v":2.207580676567944},{"$f":"IF(G81>0,(Eingaben!L114*G81*$B$6/1000)*$G$5/$G$4,0)","v":2.0002508571428579},{"$f":"IF(H81>0,(Eingaben!L114*H81*$B$6/1000)*$H$5/$H$4,0)","v":2.4750045447551021},{"$f":"IF(I81>0,(Eingaben!L114*I81*$B$6/1000)*$I$5/$I$4,0)","v":2.1162007865071772}]
["Leistung bei eingetragener Fläche (KW)",null,-30,{"$f":"IF(D80>0,(Eingaben!L113*D80*$B$6/1000)*$D$5/$D$4,0)","v":2.4781235910750001},{"$f":"IF(E80>0,(Eingaben!L113*E80*$B$6/1000)*$E$5/$E$4,0)","v":2.1855775248695664},{"$f":"IF(F80>0,(Eingaben!L113*F80*$B$6/1000)*$F$5/$F$4,0)","v":2.3671874202439018},{"$f":"IF(G80>0,(Eingaben!L113*G80*$B$6/1000)*$G$5/$G$4,0)","v":2.1509511172413798},{"$f":"IF(H80>0,(Eingaben!L113*H80*$B$6/1000)*$H$5/$H$4,0)","v":2.5807820418979595},{"$f":"IF(I80>0,(Eingaben!L113*I80*$B$6/1000)*$I$5/$I$4,0)","v":1.96556162200957}]
["Leistung bei eingetragener Fläche (KW)",null,-20,{"$f":"IF(D79>0,(Eingaben!L112*D79*$B$6/1000)*$D$5/$D$4,0)","v":2.5916938125000009},{"$f":"IF(E79>0,(Eingaben!L112*E79*$B$6/1000)*$E$5/$E$4,0)","v":2.2908185864347823},{"$f":"IF(F79>0,(Eingaben!L112*F79*$B$6/1000)*$F$5/$F$4,0)","v":2.4782389933484312},{"$f":"IF(G79>0,(Eingaben!L112*G79*$B$6/1000)*$G$5/$G$4,0)","v":2.255497941280789},{"$f":"IF(H79>0,(Eingaben!L112*H79*$B$6/1000)*$H$5/$H$4,0)","v":2.6213171195408167},{"$f":"IF(I79>0,(Eingaben!L112*I79*$B$6/1000)*$I$5/$I$4,0)","v":1.8307227089148332}]
["Leistung bei eingetragener Fläche (KW)",null,-10,{"$f":"IF(D78>0,(Eingaben!L111*D78*$B$6/1000)*$D$5/$D$4,0)","v":2.6440121175000009},{"$f":"IF(E78>0,(Eingaben!L111*E78*$B$6/1000)*$E$5/$E$4,0)","v":2.3634627710144933},{"$f":"IF(F78>0,(Eingaben!L111*F78*$B$6/1000)*$F$5/$F$4,0)","v":2.5551383675958186},{"$f":"IF(G78>0,(Eingaben!L111*G78*$B$6/1000)*$G$5/$G$4,0)","v":2.3275818719211827},{"$f":"IF(H78>0,(Eingaben!L111*H78*$B$6/1000)*$H$5/$H$4,0)","v":2.6602207200306123},{"$f":"IF(I78>0,(Eingaben!L111*I78*$B$6/1000)*$I$5/$I$4,0)","v":1.7905212794258378}]
["Leistung bei eingetragener Fläche (KW)",null,0,{"$f":"IF(D77>0,(Eingaben!L110*D77*$B$6/1000)*$D$5/$D$4,0)","v":2.6560855725000008},{"$f":"IF(E77>0,(Eingaben!L110*E77*$B$6/1000)*$E$5/$E$4,0)","v":2.3748869101449279},{"$f":"IF(F77>0,(Eingaben!L110*F77*$B$6/1000)*$F$5/$F$4,0)","v":2.5671075961672476},{"$f":"IF(G77>0,(Eingaben!L110*G77*$B$6/1000)*$G$5/$G$4,0)","v":2.3389590541871925},{"$f":"IF(H77>0,(Eingaben!L110*H77*$B$6/1000)*$H$5/$H$4,0)","v":2.6427707663265312},{"$f":"IF(I77>0,(Eingaben!L110*I77*$B$6/1000)*$I$5/$I$4,0)","v":1.7974930445933013}]
["Leistung bei eingetragener Fläche (KW)",null,10,{"$f":"IF(D78>0,(Eingaben!L111*D78*$B$6/1000)*$D$5/$D$4,0)","v":2.6440121175000009},{"$f":"IF(E78>0,(Eingaben!L111*E78*$B$6/1000)*$E$5/$E$4,0)","v":2.3634627710144933},{"$f":"IF(F78>0,(Eingaben!L111*F78*$B$6/1000)*$F$5/$F$4,0)","v":2.5551383675958186},{"$f":"IF(G78>0,(Eingaben!L111*G78*$B$6/1000)*$G$5/$G$4,0)","v":2.3275818719211827},{"$f":"IF(H78>0,(Eingaben!L111*H78*$B$6/1000)*$H$5/$H$4,0)","v":2.6602207200306123},{"$f":"IF(I78>0,(Eingaben!L111*I78*$B$6/1000)*$I$5/$I$4,0)","v":1.7905212794258378}]
["Leistung bei eingetragener Fläche (KW)",null,20,{"$f":"IF(D79>0,(Eingaben!L112*D79*$B$6/1000)*$D$5/$D$4,0)","v":2.5916938125000009},{"$f":"IF(E79>0,(Eingaben!L112*E79*$B$6/1000)*$E$5/$E$4,0)","v":2.2908185864347823},{"$f":"IF(F79>0,(Eingaben!L112*F79*$B$6/1000)*$F$5/$F$4,0)","v":2.4782389933484312},{"$f":"IF(G79>0,(Eingaben!L112*G79*$B$6/1000)*$G$5/$G$4,0)","v":2.255497941280789},{"$f":"IF(H79>0,(Eingaben!L112*H79*$B$6/1000)*$H$5/$H$4,0)","v":2.6213171195408167},{"$f":"IF(I79>0,(Eingaben!L112*I79*$B$6/1000)*$I$5/$I$4,0)","v":1.8307227089148332}]
["Leistung bei eingetragener Fläche (KW)",null,30,{"$f":"IF(D80>0,(Eingaben!L113*D80*$B$6/1000)*$D$5/$D$4,0)","v":2.4781235910750001},{"$f":"IF(E80>0,(Eingaben!L113*E80*$B$6/1000)*$E$5/$E$4,0)","v":2.1855775248695664},{"$f":"IF(F80>0,(Eingaben!L113*F80*$B$6/1000)*$F$5/$F$4,0)","v":2.3671874202439018},{"$f":"IF(G80>0,(Eingaben!L113*G80*$B$6/1000)*$G$5/$G$4,0)","v":2.1509511172413798},{"$f":"IF(H80>0,(Eingaben!L113*H80*$B$6/1000)*$H$5/$H$4,0)","v":2.5807820418979595},{"$f":"IF(I80>0,(Eingaben!L113*I80*$B$6/1000)*$I$5/$I$4,0)","v":1.96556162200957}]
["Leistung bei eingetragener Fläche (KW)",null,40,{"$f":"IF(D81>0,(Eingaben!L114*D81*$B$6/1000)*$D$5/$D$4,0)","v":2.2678062407999997},{"$f":"IF(E81>0,(Eingaben!L114*E81*$B$6/1000)*$E$5/$E$4,0)","v":2.0339925388985503},{"$f":"IF(F81>0,(Eingaben!L114*F81*$B$6/1000)*$F$5/$F$4,0)","v":2.207580676567944},{"$f":"IF(G81>0,(Eingaben!L114*G81*$B$6/1000)*$G$5/$G$4,0)","v":2.0002508571428579},{"$f":"IF(H81>0,(Eingaben!L114*H81*$B$6/1000)*$H$5/$H$4,0)","v":2.4750045447551021},{"$f":"IF(I81>0,(Eingaben!L114*I81*$B$6/1000)*$I$5/$I$4,0)","v":2.1162007865071772}]
["Leistung bei eingetragener Fläche (KW)",null,50,{"$f":"IF(D82>0,(Eingaben!L115*D82*$B$6/1000)*$D$5/$D$4,0)","v":2.0124944029500003},{"$f":"IF(E82>0,(Eingaben!L115*E82*$B$6/1000)*$E$5/$E$4,0)","v":1.7742095554782613},{"$f":"IF(F82>0,(Eingaben!L115*F82*$B$6/1000)*$F$5/$F$4,0)","v":1.9330352798257833},{"$f":"IF(G82>0,(Eingaben!L115*G82*$B$6/1000)*$G$5/$G$4,0)","v":1.7608559802955668},{"$f":"IF(H82>0,(Eingaben!L115*H82*$B$6/1000)*$H$5/$H$4,0)","v":2.218242263},{"$f":"IF(I82>0,(Eingaben!L115*I82*$B$6/1000)*$I$5/$I$4,0)","v":2.040042247196173}]
["Leistung bei eingetragener Fläche (KW)",null,60,{"$f":"IF(D83>0,(Eingaben!L116*D83*$B$6/1000)*$D$5/$D$4,0)","v":1.5677947726500006},{"$f":"IF(E83>0,(Eingaben!L116*E83*$B$6/1000)*$E$5/$E$4,0)","v":1.4279591791304349},{"$f":"IF(F83>0,(Eingaben!L116*F83*$B$6/1000)*$F$5/$F$4,0)","v":1.5671077422648081},{"$f":"IF(G83>0,(Eingaben!L116*G83*$B$6/1000)*$G$5/$G$4,0)","v":1.3985401300492617},{"$f":"IF(H83>0,(Eingaben!L116*H83*$B$6/1000)*$H$5/$H$4,0)","v":2.1309110132142863},{"$f":"IF(I83>0,(Eingaben!L116*I83*$B$6/1000)*$I$5/$I$4,0)","v":1.7640312723712923}]
["Leistung bei eingetragener Fläche (KW)",null,70,{"$f":"IF(D84>0,(Eingaben!L117*D84*$B$6/1000)*$D$5/$D$4,0)","v":0.99882277192500035},{"$f":"IF(E84>0,(Eingaben!L117*E84*$B$6/1000)*$E$5/$E$4,0)","v":0.92504965565217401},{"$f":"IF(F84>0,(Eingaben!L117*F84*$B$6/1000)*$F$5/$F$4,0)","v":1.0452158043240416},{"$f":"IF(G84>0,(Eingaben!L117*G84*$B$6/1000)*$G$5/$G$4,0)","v":0.91156828610837481},{"$f":"IF(H84>0,(Eingaben!L117*H84*$B$6/1000)*$H$5/$H$4,0)","v":1.9318726523877552},{"$f":"IF(I84>0,(Eingaben!L117*I84*$B$6/1000)*$I$5/$I$4,0)","v":1.1697602836708139}]
["KW Schnitt  > ",null,null,{"$f":"SUM(D86:D100)/15","v":2.1185053994200005},{"$f":"SUM(E86:E100)/15","v":1.8918017688734305},2.0582744109672473,1.8632967614844014,2.391964765065306,1.810078229652313]
["KWH gesamt bei Azimut -70 bis +70 > ",null,null,{"$f":"IF(D101>0,D101*$B$17,0)","v":12.499181856578003},11.16163043635324,12.14381902470676,10.993450892757968,14.112592113885306,10.679461554948647]
["Puffervolumen (L) > ",{"$f":"B45","v":1500},"Erwärmung (K)>",{"$f":"IF(D102>0,D102/(($B$45/1000)*1*1.163),0)","v":7.1649079143468066},{"$f":"IF(E102>0,E102/(($B$45/1000)*1*1.163),0)","v":6.3981831105492928},6.9612032242515109,6.3017775252266945,8.0897633212297535,6.1217893694173959]
["Laufzeit gesamt (Std.) > ",{"$f":"B17","v":5.9},{"$f":"\"Berechnung nach Tagesverlauf bei starker Bewölkung (mit IAM) mit Diff. \"&B5&\"  bei  \"&B6&\" m²\"&\"  am \"","v":"Berechnung nach Tagesverlauf bei starker Bewölkung (mit IAM) mit Diff. 35  bei  10,46 m²  am "},null,null,null,null,{"$f":"H17","v":"2013-06-21"}]
["Wirkungsgrad bei  Diff.0  > ",null,null,{"$f":"$D$6-$D$7*(0/1000)-$D$8*1000*((0/1000*0/1000))","v":0.81},{"$f":"$E$6-$E$7*(0/1000)-$E$8*1000*((0/1000*0/1000))","v":0.78500000000000003},{"$f":"$F$6-$F$7*(0/1000)-$F$8*1000*((0/1000*0/1000))","v":0.82},{"$f":"$G$6-$G$7*(0/1000)-$G$8*1000*((0/1000*0/1000))","v":0.8},{"$f":"$H$6-$H$7*(0/1000)-$H$8*1000*((0/1000*0/1000))","v":0.64},{"$f":"$I$6-$I$7*(0/1000)-$I$8*1000*((0/1000*0/1000))","v":0.65400000000000003}]
["Wirkungsgrad bei eingestellter Diff. bei   0° >",null,null,{"$f":"IF(Eingaben!L146>0,($D$6-$D$7*($B$5/Eingaben!L146)-$D$8*Eingaben!L146*(($B$5/Eingaben!L146*$B$5/Eingaben!L146)))*$D$9,0)","v":0.26670694864048339},{"$f":"IF(Eingaben!L146>0,($E$6-$E$7*($B$5/Eingaben!L146)-$E$8*Eingaben!L146*(($B$5/Eingaben!L146*$B$5/Eingaben!L146)))*$E$9,0)","v":0.20103222557905334},{"$f":"IF(Eingaben!L146>0,($F$6-$F$7*($B$5/Eingaben!L146)-$F$8*Eingaben!L146*(($B$5/Eingaben!L146*$B$5/Eingaben!L146)))*$F$9,0)","v":0.24265861027190327},{"$f":"IF(Eingaben!L146>0,($G$6-$G$7*($B$5/Eingaben!L146)-$G$8*Eingaben!L146*(($B$5/Eingaben!L146*$B$5/Eingaben!L146)))*$G$9,0)","v":0.19375629405840883},{"$f":"IF(Eingaben!L146>0,($H$6-$H$7*($B$5/Eingaben!L146)-$H$8*Eingaben!L146*(($B$5/Eingaben!L146*$B$5/Eingaben!L146)))*$H$9,0)","v":0.50972809667673713},{"$f":"IF(Eingaben!L146>0,($I$6-$I$7*($B$5/Eingaben!L146)-$I$8*Eingaben!L146*(($B$5/Eingaben!L146*$B$5/Eingaben!L146)))*$I$9,0)","v":0.36483585095669685}]
["Wirkungsgrad bei eingestellter Diff. bei 10° >",null,null,{"$f":"IF(Eingaben!L147>0,($D$6-$D$7*($B$5/Eingaben!L147)-$D$8*Eingaben!L147*(($B$5/Eingaben!L147*$B$5/Eingaben!L147)))*$D$10,0)","v":0.26506060606060616},{"$f":"IF(Eingaben!L147>0,($E$6-$E$7*($B$5/Eingaben!L147)-$E$8*Eingaben!L147*(($B$5/Eingaben!L147*$B$5/Eingaben!L147)))*$E$10,0)","v":0.19926262626262631},{"$f":"IF(Eingaben!L147>0,($F$6-$F$7*($B$5/Eingaben!L147)-$F$8*Eingaben!L147*(($B$5/Eingaben!L147*$B$5/Eingaben!L147)))*$F$10,0)","v":0.24090909090909088},{"$f":"IF(Eingaben!L147>0,($G$6-$G$7*($B$5/Eingaben!L147)-$G$8*Eingaben!L147*(($B$5/Eingaben!L147*$B$5/Eingaben!L147)))*$G$10,0)","v":0.19191919191919196},{"$f":"IF(Eingaben!L147>0,($H$6-$H$7*($B$5/Eingaben!L147)-$H$8*Eingaben!L147*(($B$5/Eingaben!L147*$B$5/Eingaben!L147)))*$H$10,0)","v":0.51442666666666681},{"$f":"IF(Eingaben!L147>0,($I$6-$I$7*($B$5/Eingaben!L147)-$I$8*Eingaben!L147*(($B$5/Eingaben!L147*$B$5/Eingaben!L147)))*$I$10,0)","v":0.36395959595959598}]
["Wirkungsgrad bei eingestellter Diff. bei 20° >",null,null,{"$f":"IF(Eingaben!L148>0,($D$6-$D$7*($B$5/Eingaben!L148)-$D$8*Eingaben!L148*(($B$5/Eingaben!L148*$B$5/Eingaben!L148)))*$D$11,0)","v":0.25780962128966228},{"$f":"IF(Eingaben!L148>0,($E$6-$E$7*($B$5/Eingaben!L148)-$E$8*Eingaben!L148*(($B$5/Eingaben!L148*$B$5/Eingaben!L148)))*$E$11,0)","v":0.18955409416581367},{"$f":"IF(Eingaben!L148>0,($F$6-$F$7*($B$5/Eingaben!L148)-$F$8*Eingaben!L148*(($B$5/Eingaben!L148*$B$5/Eingaben!L148)))*$F$11,0)","v":0.23087164790173995},{"$f":"IF(Eingaben!L148>0,($G$6-$G$7*($B$5/Eingaben!L148)-$G$8*Eingaben!L148*(($B$5/Eingaben!L148*$B$5/Eingaben!L148)))*$G$11,0)","v":0.1819897645854657},{"$f":"IF(Eingaben!L148>0,($H$6-$H$7*($B$5/Eingaben!L148)-$H$8*Eingaben!L148*(($B$5/Eingaben!L148*$B$5/Eingaben!L148)))*$H$11,0)","v":0.51267062436028665},{"$f":"IF(Eingaben!L148>0,($I$6-$I$7*($B$5/Eingaben!L148)-$I$8*Eingaben!L148*(($B$5/Eingaben!L148*$B$5/Eingaben!L148)))*$I$11,0)","v":0.37450431934493345}]
["Wirkungsgrad bei eingestellter Diff. bei 30° >",null,null,{"$f":"IF(Eingaben!L149>0,($D$6-$D$7*($B$5/Eingaben!L149)-$D$8*Eingaben!L149*(($B$5/Eingaben!L149*$B$5/Eingaben!L149)))*$D$12,0)","v":0.24263811518324621},{"$f":"IF(Eingaben!L149>0,($E$6-$E$7*($B$5/Eingaben!L149)-$E$8*Eingaben!L149*(($B$5/Eingaben!L149*$B$5/Eingaben!L149)))*$E$12,0)","v":0.17423989528795814},{"$f":"IF(Eingaben!L149>0,($F$6-$F$7*($B$5/Eingaben!L149)-$F$8*Eingaben!L149*(($B$5/Eingaben!L149*$B$5/Eingaben!L149)))*$F$12,0)","v":0.21529214659685864},{"$f":"IF(Eingaben!L149>0,($G$6-$G$7*($B$5/Eingaben!L149)-$G$8*Eingaben!L149*(($B$5/Eingaben!L149*$B$5/Eingaben!L149)))*$G$12,0)","v":0.16624083769633513},{"$f":"IF(Eingaben!L149>0,($H$6-$H$7*($B$5/Eingaben!L149)-$H$8*Eingaben!L149*(($B$5/Eingaben!L149*$B$5/Eingaben!L149)))*$H$12,0)","v":0.51463539267015712},{"$f":"IF(Eingaben!L149>0,($I$6-$I$7*($B$5/Eingaben!L149)-$I$8*Eingaben!L149*(($B$5/Eingaben!L149*$B$5/Eingaben!L149)))*$I$12,0)","v":0.40632931937172784}]
["Wirkungsgrad bei eingestellter Diff. bei 40° >",null,null,{"$f":"IF(Eingaben!L150>0,($D$6-$D$7*($B$5/Eingaben!L150)-$D$8*Eingaben!L150*(($B$5/Eingaben!L150*$B$5/Eingaben!L150)))*$D$13,0)","v":0.21465391304347822},{"$f":"IF(Eingaben!L150>0,($E$6-$E$7*($B$5/Eingaben!L150)-$E$8*Eingaben!L150*(($B$5/Eingaben!L150*$B$5/Eingaben!L150)))*$E$13,0)","v":0.15005478260869562},{"$f":"IF(Eingaben!L150>0,($F$6-$F$7*($B$5/Eingaben!L150)-$F$8*Eingaben!L150*(($B$5/Eingaben!L150*$B$5/Eingaben!L150)))*$F$13,0)","v":0.19094239130434776},{"$f":"IF(Eingaben!L150>0,($G$6-$G$7*($B$5/Eingaben!L150)-$G$8*Eingaben!L150*(($B$5/Eingaben!L150*$B$5/Eingaben!L150)))*$G$13,0)","v":0.14128260869565218},{"$f":"IF(Eingaben!L150>0,($H$6-$H$7*($B$5/Eingaben!L150)-$H$8*Eingaben!L150*(($B$5/Eingaben!L150*$B$5/Eingaben!L150)))*$H$13,0)","v":0.50937913043478267},{"$f":"IF(Eingaben!L150>0,($I$6-$I$7*($B$5/Eingaben!L150)-$I$8*Eingaben!L150*(($B$5/Eingaben!L150*$B$5/Eingaben!L150)))*$I$13,0)","v":0.44445869565217394}]
["Wirkungsgrad bei eingestellter Diff. bei 50° >",null,null,{"$f":"IF(Eingaben!L151>0,($D$6-$D$7*($B$5/Eingaben!L151)-$D$8*Eingaben!L151*(($B$5/Eingaben!L151*$B$5/Eingaben!L151)))*$D$14,0)","v":0.17513341040462438},{"$f":"IF(Eingaben!L151>0,($E$6-$E$7*($B$5/Eingaben!L151)-$E$8*Eingaben!L151*(($B$5/Eingaben!L151*$B$5/Eingaben!L151)))*$E$14,0)","v":0.10774138728323698},{"$f":"IF(Eingaben!L151>0,($F$6-$F$7*($B$5/Eingaben!L151)-$F$8*Eingaben!L151*(($B$5/Eingaben!L151*$B$5/Eingaben!L151)))*$F$14,0)","v":0.14779190751445082},{"$f":"IF(Eingaben!L151>0,($G$6-$G$7*($B$5/Eingaben!L151)-$G$8*Eingaben!L151*(($B$5/Eingaben!L151*$B$5/Eingaben!L151)))*$G$14,0)","v":9.8843930635838184E-2},{"$f":"IF(Eingaben!L151>0,($H$6-$H$7*($B$5/Eingaben!L151)-$H$8*Eingaben!L151*(($B$5/Eingaben!L151*$B$5/Eingaben!L151)))*$H$14,0)","v":0.48064184971098267},{"$f":"IF(Eingaben!L151>0,($I$6-$I$7*($B$5/Eingaben!L151)-$I$8*Eingaben!L151*(($B$5/Eingaben!L151*$B$5/Eingaben!L151)))*$I$14,0)","v":0.43798289017341047}]
["Wirkungsgrad bei eingestellter Diff. bei 60° >",null,null,{"$f":"IF(Eingaben!L152>0,($D$6-$D$7*($B$5/Eingaben!L152)-$D$8*Eingaben!L152*(($B$5/Eingaben!L152*$B$5/Eingaben!L152)))*$D$15,0)","v":0.10631832061068705},{"$f":"IF(Eingaben!L152>0,($E$6-$E$7*($B$5/Eingaben!L152)-$E$8*Eingaben!L152*(($B$5/Eingaben!L152*$B$5/Eingaben!L152)))*$E$15,0)","v":4.2515267175572552E-2},{"$f":"IF(Eingaben!L152>0,($F$6-$F$7*($B$5/Eingaben!L152)-$F$8*Eingaben!L152*(($B$5/Eingaben!L152*$B$5/Eingaben!L152)))*$F$15,0)","v":8.1549618320610584E-2},{"$f":"IF(Eingaben!L152>0,($G$6-$G$7*($B$5/Eingaben!L152)-$G$8*Eingaben!L152*(($B$5/Eingaben!L152*$B$5/Eingaben!L152)))*$G$15,0)","v":3.0687022900763333E-2},{"$f":"IF(Eingaben!L152>0,($H$6-$H$7*($B$5/Eingaben!L152)-$H$8*Eingaben!L152*(($B$5/Eingaben!L152*$B$5/Eingaben!L152)))*$H$15,0)","v":0.49919083969465655},{"$f":"IF(Eingaben!L152>0,($I$6-$I$7*($B$5/Eingaben!L152)-$I$8*Eingaben!L152*(($B$5/Eingaben!L152*$B$5/Eingaben!L152)))*$I$15,0)","v":0.38683379134860052}]
["Wirkungsgrad bei eingestellter Diff. bei 70° >",null,null,{"$f":"IF(Eingaben!L142>0,($D$6-$D$7*($B$5/Eingaben!L142)-$D$8*Eingaben!L142*(($B$5/Eingaben!L142*$B$5/Eingaben!L142)))*$D$16,0)","v":-0.60939420731707306},{"$f":"IF(Eingaben!L142>0,($E$6-$E$7*($B$5/Eingaben!L142)-$E$8*Eingaben!L142*(($B$5/Eingaben!L142*$B$5/Eingaben!L142)))*$E$16,0)","v":-0.78634146341463418},{"$f":"IF(Eingaben!L142>0,($F$6-$F$7*($B$5/Eingaben!L142)-$F$8*Eingaben!L142*(($B$5/Eingaben!L142*$B$5/Eingaben!L142)))*$F$16,0)","v":-0.75157134146341475},{"$f":"IF(Eingaben!L142>0,($G$6-$G$7*($B$5/Eingaben!L142)-$G$8*Eingaben!L142*(($B$5/Eingaben!L142*$B$5/Eingaben!L142)))*$G$16,0)","v":-0.83864634146341477},{"$f":"IF(Eingaben!L142>0,($H$6-$H$7*($B$5/Eingaben!L142)-$H$8*Eingaben!L142*(($B$5/Eingaben!L142*$B$5/Eingaben!L142)))*$H$16,0)","v":0.27999512195121951},{"$f":"IF(Eingaben!L142>0,($I$6-$I$7*($B$5/Eingaben!L142)-$I$8*Eingaben!L142*(($B$5/Eingaben!L142*$B$5/Eingaben!L142)))*$I$16,0)","v":-0.24578378048780491}]
["Leistung nach Tagesverlauf  ",null,"Azimut",{"$f":"D27","v":"SolRose 26"},{"$f":"E27","v":"Synergie 210"},"Sunex AMX 2,85","Sunex 2,0","Star Azzurro CPC","Billig VRK"]
["Leistung bei eingetragener Fläche (KW)",null,-70,{"$f":"IF(D113>0,(Eingaben!L142*D113*$B$6/1000)*$D$5/$D$4,0)","v":0},{"$f":"IF(E113>0,(Eingaben!L142*E113*$B$6/1000)*$E$5/$E$4,0)","v":0},{"$f":"IF(F113>0,(Eingaben!L142*F113*$B$6/1000)*$F$5/$F$4,0)","v":0},{"$f":"IF(G113>0,(Eingaben!L142*G113*$B$6/1000)*$G$5/$G$4,0)","v":0},{"$f":"IF(H113>0,(Eingaben!L142*H113*$B$6/1000)*$H$5/$H$4,0)","v":0.21258832487755103},{"$f":"IF(I113>0,(Eingaben!L142*I113*$B$6/1000)*$I$5/$I$4,0)","v":0}]
["Leistung bei eingetragener Fläche (KW)",null,-60,{"$f":"IF(D112>0,(Eingaben!L152*D112*$B$6/1000)*$D$5/$D$4,0)","v":0.20759933235000011},{"$f":"IF(E112>0,(Eingaben!L152*E112*$B$6/1000)*$E$5/$E$4,0)","v":8.1053175652173987E-2},{"$f":"IF(F112>0,(Eingaben!L152*F112*$B$6/1000)*$F$5/$F$4,0)","v":0.15593569369337959},{"$f":"IF(G112>0,(Eingaben!L152*G112*$B$6/1000)*$G$5/$G$4,0)","v":5.7170340886699471E-2},{"$f":"IF(H112>0,(Eingaben!L152*H112*$B$6/1000)*$H$5/$H$4,0)","v":0.90824759035714309},{"$f":"IF(I112>0,(Eingaben!L152*I112*$B$6/1000)*$I$5/$I$4,0)","v":0.5402076148746412}]
["Leistung bei eingetragener Fläche (KW)",null,-50,{"$f":"IF(D111>0,(Eingaben!L151*D111*$B$6/1000)*$D$5/$D$4,0)","v":0.37634002620000029},{"$f":"IF(E111>0,(Eingaben!L151*E111*$B$6/1000)*$E$5/$E$4,0)","v":0.22604830098550727},{"$f":"IF(F111>0,(Eingaben!L151*F111*$B$6/1000)*$F$5/$F$4,0)","v":0.31100532125435537},{"$f":"IF(G111>0,(Eingaben!L151*G111*$B$6/1000)*$G$5/$G$4,0)","v":0.20265605911330062},{"$f":"IF(H111>0,(Eingaben!L151*H111*$B$6/1000)*$H$5/$H$4,0)","v":0.96239374300000025},{"$f":"IF(I111>0,(Eingaben!L151*I111*$B$6/1000)*$I$5/$I$4,0)","v":0.67311149002870829}]
["Leistung bei eingetragener Fläche (KW)",null,-40,{"$f":"IF(D110>0,(Eingaben!L150*D110*$B$6/1000)*$D$5/$D$4,0)","v":0.49059366479999983},{"$f":"IF(E110>0,(Eingaben!L150*E110*$B$6/1000)*$E$5/$E$4,0)","v":0.3348422455652173},{"$f":"IF(F110>0,(Eingaben!L150*F110*$B$6/1000)*$F$5/$F$4,0)","v":0.4273574137108011},{"$f":"IF(G110>0,(Eingaben!L150*G110*$B$6/1000)*$G$5/$G$4,0)","v":0.30808461477832516},{"$f":"IF(H110>0,(Eingaben!L150*H110*$B$6/1000)*$H$5/$H$4,0)","v":1.0847860108775511},{"$f":"IF(I110>0,(Eingaben!L150*I110*$B$6/1000)*$I$5/$I$4,0)","v":0.72649559645933004}]
["Leistung bei eingetragener Fläche (KW)",null,-30,{"$f":"IF(D109>0,(Eingaben!L149*D109*$B$6/1000)*$D$5/$D$4,0)","v":0.57564891945000041},{"$f":"IF(E109>0,(Eingaben!L149*E109*$B$6/1000)*$E$5/$E$4,0)","v":0.40360222284057984},{"$f":"IF(F109>0,(Eingaben!L149*F109*$B$6/1000)*$F$5/$F$4,0)","v":0.50018725024390243},{"$f":"IF(G109>0,(Eingaben!L149*G109*$B$6/1000)*$G$5/$G$4,0)","v":0.37630030344827614},{"$f":"IF(H109>0,(Eingaben!L149*H109*$B$6/1000)*$H$5/$H$4,0)","v":1.13767475944898},{"$f":"IF(I109>0,(Eingaben!L149*I109*$B$6/1000)*$I$5/$I$4,0)","v":0.68943810614832579}]
["Leistung bei eingetragener Fläche (KW)",null,-20,{"$f":"IF(D108>0,(Eingaben!L148*D108*$B$6/1000)*$D$5/$D$4,0)","v":0.62573289000000021},{"$f":"IF(E108>0,(Eingaben!L148*E108*$B$6/1000)*$E$5/$E$4,0)","v":0.44919023791304347},{"$f":"IF(F108>0,(Eingaben!L148*F108*$B$6/1000)*$F$5/$F$4,0)","v":0.54873950149128892},{"$f":"IF(G108>0,(Eingaben!L148*G108*$B$6/1000)*$G$5/$G$4,0)","v":0.42143927408867005},{"$f":"IF(H108>0,(Eingaben!L148*H108*$B$6/1000)*$H$5/$H$4,0)","v":1.1594395165204086},{"$f":"IF(I108>0,(Eingaben!L148*I108*$B$6/1000)*$I$5/$I$4,0)","v":0.65007751702200955}]
["Leistung bei eingetragener Fläche (KW)",null,-10,{"$f":"IF(D107>0,(Eingaben!L147*D107*$B$6/1000)*$D$5/$D$4,0)","v":0.65189204250000032},{"$f":"IF(E107>0,(Eingaben!L147*E107*$B$6/1000)*$E$5/$E$4,0)","v":0.47847981449275367},{"$f":"IF(F107>0,(Eingaben!L147*F107*$B$6/1000)*$F$5/$F$4,0)","v":0.5802156533101045},{"$f":"IF(G107>0,(Eingaben!L147*G107*$B$6/1000)*$G$5/$G$4,0)","v":0.45034679802955679},{"$f":"IF(H107>0,(Eingaben!L147*H107*$B$6/1000)*$H$5/$H$4,0)","v":1.1788913167653068},{"$f":"IF(I107>0,(Eingaben!L147*I107*$B$6/1000)*$I$5/$I$4,0)","v":0.64018002679425845}]
["Leistung bei eingetragener Fläche (KW)",null,0,{"$f":"IF(D106>0,(Eingaben!L146*D106*$B$6/1000)*$D$5/$D$4,0)","v":0.65792877000000005},{"$f":"IF(E106>0,(Eingaben!L146*E106*$B$6/1000)*$E$5/$E$4,0)","v":0.48419188405797103},{"$f":"IF(F106>0,(Eingaben!L146*F106*$B$6/1000)*$F$5/$F$4,0)","v":0.58620026759581867},{"$f":"IF(G106>0,(Eingaben!L146*G106*$B$6/1000)*$G$5/$G$4,0)","v":0.45603538916256164},{"$f":"IF(H106>0,(Eingaben!L146*H106*$B$6/1000)*$H$5/$H$4,0)","v":1.1716635581632655},{"$f":"IF(I106>0,(Eingaben!L146*I106*$B$6/1000)*$I$5/$I$4,0)","v":0.64366590937799051}]
["Leistung bei eingetragener Fläche (KW)",null,10,{"$f":"IF(D107>0,(Eingaben!L147*D107*$B$6/1000)*$D$5/$D$4,0)","v":0.65189204250000032},{"$f":"IF(E107>0,(Eingaben!L147*E107*$B$6/1000)*$E$5/$E$4,0)","v":0.47847981449275367},{"$f":"IF(F107>0,(Eingaben!L147*F107*$B$6/1000)*$F$5/$F$4,0)","v":0.5802156533101045},{"$f":"IF(G107>0,(Eingaben!L147*G107*$B$6/1000)*$G$5/$G$4,0)","v":0.45034679802955679},{"$f":"IF(H107>0,(Eingaben!L147*H107*$B$6/1000)*$H$5/$H$4,0)","v":1.1788913167653068},{"$f":"IF(I107>0,(Eingaben!L147*I107*$B$6/1000)*$I$5/$I$4,0)","v":0.64018002679425845}]
["Leistung bei eingetragener Fläche (KW)",null,20,{"$f":"IF(D108>0,(Eingaben!L148*D108*$B$6/1000)*$D$5/$D$4,0)","v":0.62573289000000021},{"$f":"IF(E108>0,(Eingaben!L148*E108*$B$6/1000)*$E$5/$E$4,0)","v":0.44919023791304347},{"$f":"IF(F108>0,(Eingaben!L148*F108*$B$6/1000)*$F$5/$F$4,0)","v":0.54873950149128892},{"$f":"IF(G108>0,(Eingaben!L148*G108*$B$6/1000)*$G$5/$G$4,0)","v":0.42143927408867005},{"$f":"IF(H108>0,(Eingaben!L148*H108*$B$6/1000)*$H$5/$H$4,0)","v":1.1594395165204086},{"$f":"IF(I108>0,(Eingaben!L148*I108*$B$6/1000)*$I$5/$I$4,0)","v":0.65007751702200955}]
["Leistung bei eingetragener Fläche (KW)",null,30,{"$f":"IF(D109>0,(Eingaben!L149*D109*$B$6/1000)*$D$5/$D$4,0)","v":0.57564891945000041},{"$f":"IF(E109>0,(Eingaben!L149*E109*$B$6/1000)*$E$5/$E$4,0)","v":0.40360222284057984},{"$f":"IF(F109>0,(Eingaben!L149*F109*$B$6/1000)*$F$5/$F$4,0)","v":0.50018725024390243},{"$f":"IF(G109>0,(Eingaben!L149*G109*$B$6/1000)*$G$5/$G$4,0)","v":0.37630030344827614},{"$f":"IF(H109>0,(Eingaben!L149*H109*$B$6/1000)*$H$5/$H$4,0)","v":1.13767475944898},{"$f":"IF(I109>0,(Eingaben!L149*I109*$B$6/1000)*$I$5/$I$4,0)","v":0.68943810614832579}]
["Leistung bei eingetragener Fläche (KW)",null,40,{"$f":"IF(D110>0,(Eingaben!L150*D110*$B$6/1000)*$D$5/$D$4,0)","v":0.49059366479999983},{"$f":"IF(E110>0,(Eingaben!L150*E110*$B$6/1000)*$E$5/$E$4,0)","v":0.3348422455652173},{"$f":"IF(F110>0,(Eingaben!L150*F110*$B$6/1000)*$F$5/$F$4,0)","v":0.4273574137108011},{"$f":"IF(G110>0,(Eingaben!L150*G110*$B$6/1000)*$G$5/$G$4,0)","v":0.30808461477832516},{"$f":"IF(H110>0,(Eingaben!L150*H110*$B$6/1000)*$H$5/$H$4,0)","v":1.0847860108775511},{"$f":"IF(I110>0,(Eingaben!L150*I110*$B$6/1000)*$I$5/$I$4,0)","v":0.72649559645933004}]
["Leistung bei eingetragener Fläche (KW)",null,50,{"$f":"IF(D111>0,(Eingaben!L151*D111*$B$6/1000)*$D$5/$D$4,0)","v":0.37634002620000029},{"$f":"IF(E111>0,(Eingaben!L151*E111*$B$6/1000)*$E$5/$E$4,0)","v":0.22604830098550727},{"$f":"IF(F111>0,(Eingaben!L151*F111*$B$6/1000)*$F$5/$F$4,0)","v":0.31100532125435537},{"$f":"IF(G111>0,(Eingaben!L151*G111*$B$6/1000)*$G$5/$G$4,0)","v":0.20265605911330062},{"$f":"IF(H111>0,(Eingaben!L151*H111*$B$6/1000)*$H$5/$H$4,0)","v":0.96239374300000025},{"$f":"IF(I111>0,(Eingaben!L151*I111*$B$6/1000)*$I$5/$I$4,0)","v":0.67311149002870829}]
["Leistung bei eingetragener Fläche (KW)",null,60,{"$f":"IF(D112>0,(Eingaben!L152*D112*$B$6/1000)*$D$5/$D$4,0)","v":0.20759933235000011},{"$f":"IF(E112>0,(Eingaben!L152*E112*$B$6/1000)*$E$5/$E$4,0)","v":8.1053175652173987E-2},{"$f":"IF(F112>0,(Eingaben!L152*F112*$B$6/1000)*$F$5/$F$4,0)","v":0.15593569369337959},{"$f":"IF(G112>0,(Eingaben!L152*G112*$B$6/1000)*$G$5/$G$4,0)","v":5.7170340886699471E-2},{"$f":"IF(H112>0,(Eingaben!L152*H112*$B$6/1000)*$H$5/$H$4,0)","v":0.90824759035714309},{"$f":"IF(I112>0,(Eingaben!L152*I112*$B$6/1000)*$I$5/$I$4,0)","v":0.5402076148746412}]
["Leistung bei eingetragener Fläche (KW)",null,70,{"$f":"IF(D113>0,(Eingaben!L142*D113*$B$6/1000)*$D$5/$D$4,0)","v":0},{"$f":"IF(E113>0,(Eingaben!L142*E113*$B$6/1000)*$E$5/$E$4,0)","v":0},{"$f":"IF(F113>0,(Eingaben!L142*F113*$B$6/1000)*$F$5/$F$4,0)","v":0},{"$f":"IF(G113>0,(Eingaben!L142*G113*$B$6/1000)*$G$5/$G$4,0)","v":0},{"$f":"IF(H113>0,(Eingaben!L142*H113*$B$6/1000)*$H$5/$H$4,0)","v":0.21258832487755103},{"$f":"IF(I113>0,(Eingaben!L142*I113*$B$6/1000)*$I$5/$I$4,0)","v":0}]
["KW Schnitt  > ",null,null,{"$f":"SUM(D115:D129)/15","v":0.43423616804000009},{"$f":"SUM(E115:E129)/15","v":0.29537492526376818},0.37553879566689891,0.2725353446568145,0.96398040545714314,0.56551244080216911]
["KWH gesamt bei Azimut -70 bis +70 > ",null,null,{"$f":"IF(D130>0,D130*$B$17,0)","v":2.5619933914360007},1.7427120590562324,2.2156788944347037,1.6079585334752056,5.6874843921971445,3.3365234007327982]
["Puffervolumen (L) > ",{"$f":"B45","v":1500},"Erwärmung (K)>",{"$f":"IF(D131>0,D131/(($B$45/1000)*1*1.163),0)","v":1.4686118609550018},{"$f":"IF(E131>0,E131/(($B$45/1000)*1*1.163),0)","v":0.99897509834120524},1.2700939492317018,0.9217303144025254,3.2602375421021179,1.9125958158399532]

{"sheet":"Diagramme","index":4,"n_rows":29,"n_cols":18,"rows_kept":29,"cut":false,"hidden":false,"merged":[[21,1,21,4],[17,5,20,5],[17,11,20,11],[17,17,20,17],[28,1,28,5],[28,7,28,11],[28,13,28,17],[25,1,25,3],[24,1,24,3],[23,1,23,3],[22,1,22,3],[27,1,27,3],[26,1,26,3],[20,1,20,3],[20,7,20,9],[20,13,20,15],[26,13,26,15],[27,13,27,15],[21,13,21,16],[21,7,21,10],[22,13,22,15],[23,13,23,15],[24,13,24,15],[25,13,25,15],[22,7,22,9],[23,7,23,9],[24,7,24,9],[25,7,25,9],[26,7,26,9],[27,7,27,9],[0,1,0,5],[0,7,0,11],[0,13,0,17],[19,1,19,3],[19,7,19,9],[19,13,19,15],[17,1,17,3],[18,1,18,3],[17,7,17,9],[18,7,18,9],[17,13,17,15],[18,13,18,15]]}
[null,"Sommer",null,null,null,null,null,"Frühjahr/Herbst",null,null,null,null,null,"Winter"]
[]
[]
[]
[]
[]
[]
[]
[]
[]
[]
[]
[]
[]
[]
[]
[]
[null,"Gesamtfläche (m²) >",null,null,{"$f":"Sommer!B6","v":10.46},null,null,"Gesamtfläche (m²) >",null,null,{"$f":"Herbstfrühjahr!B6","v":10.46},null,null,"Gesamtfläche (m²) >",null,null,{"$f":"Winter!B6","v":10.46}]
[null,"Temperaturdifferenz (fix in K) >",null,null,{"$f":"Sommer!B5","v":35},null,null,"Temperaturdifferenz (fix in K) >",null,null,{"$f":"Herbstfrühjahr!B5","v":32},null,null,"Temperaturdifferenz (fix in K) >",null,null,{"$f":"Winter!B5","v":28}]
[null,"eingetragenes Datum >",null,null,{"$f":"Sommer!B8","v":"2013-06-21"},null,null,"eingetragenes Datum >",null,null,{"$f":"Herbstfrühjahr!B8","v":"2013-09-23"},null,null,"eingetragenes Datum >",null,null,{"$f":"Winter!B8","v":"2013-12-21"}]
[null,"Lfz. Von Azimut -70bis+70 (Std.)",null,null,{"$f":"Sommer!B17","v":5.9},null,null,"Lfz. Von Azimut -70bis+70 (Std.)",null,null,{"$f":"Herbstfrühjahr!B17","v":8.5},null,null,"Lfz. Von Azimut -70bis+70 (Std.)",null,null,{"$f":"Winter!B17","v":7.5}]
[null,"KW Schnitt Sommertag",null,null,null,"Ertrag (kWh)",null,"KW Schnitt Frühjahr/Herbst Tag",null,null,null,"Ertrag (kWh)",null,"KW Schnitt Wintertag",null,null,null,"Ertrag (kWh)"]
[null,{"$f":"Herbstfrühjahr!D3","v":"SolRose 26"},null,null,{"$f":"Sommer!D43","v":5.4843163544200006},{"$f":"Sommer!D44","v":32.357466491078007},null,{"$f":"B23","v":"SolRose 26"},null,null,{"$f":"Herbstfrühjahr!D43","v":4.395392094668801},{"$f":"Herbstfrühjahr!D44","v":37.360832804684811},null,{"$f":"B23","v":"SolRose 26"},null,null,{"$f":"Winter!D43","v":1.5482883621540005},{"$f":"Winter!D44","v":11.612162716155003}]
[null,{"$f":"Herbstfrühjahr!E3","v":"Synergie 210"},null,null,{"$f":"Sommer!E43","v":5.1113425038222244},{"$f":"Sommer!E44","v":30.156920772551125},null,"Synergie 210",null,null,{"$f":"Herbstfrühjahr!E43","v":4.0574189084939141},{"$f":"Herbstfrühjahr!E44","v":34.48806072219827},null,"Synergie 210",null,null,{"$f":"Winter!E43","v":1.3921779539354593},{"$f":"Winter!E44","v":10.441334654515945}]
[null,{"$f":"Herbstfrühjahr!F3","v":"Sunex AMX 2,85"},null,null,{"$f":"Sommer!F43","v":5.4350118969101038},{"$f":"Sommer!F44","v":32.066570191769614},null,"Sunex AMX 2,85",null,null,{"$f":"Herbstfrühjahr!F43","v":4.3301631836443208},{"$f":"Herbstfrühjahr!F44","v":36.806387060976725},null,"Sunex AMX 2,85",null,null,{"$f":"Winter!F43","v":1.5077900230087804},{"$f":"Winter!F44","v":11.308425172565853}]
[null,{"$f":"Herbstfrühjahr!G3","v":"Sunex 2,0"},null,null,{"$f":"Sommer!G43","v":5.0773810907848951},{"$f":"Sommer!G44","v":29.956548435630882},null,"Sunex 2,0",null,null,{"$f":"Herbstfrühjahr!G43","v":4.0175793705195426},{"$f":"Herbstfrühjahr!G44","v":34.149424649416112},null,"Sunex 2,0",null,null,{"$f":"Winter!G43","v":1.3650102592147133},{"$f":"Winter!G44","v":10.23757694411035}]
[null,{"$f":"Herbstfrühjahr!H3","v":"Star Azzurro CPC"},null,null,{"$f":"Sommer!H43","v":5.092556118730613},{"$f":"Sommer!H44","v":30.046081100510619},null,"Star Azzurro CPC",null,null,{"$f":"Herbstfrühjahr!H43","v":4.0639825019276197},{"$f":"Herbstfrühjahr!H44","v":34.54385126638477},null,"Star Azzurro CPC",null,null,{"$f":"Winter!H43","v":1.5262170866443541},{"$f":"Winter!H44","v":11.446628149832655}]
[null,{"$f":"Herbstfrühjahr!I3","v":"Billig VRK"},null,null,{"$f":"Sommer!I43","v":4.2187456309537472},{"$f":"Sommer!I44","v":24.89059922262711},null,"Billig VRK",null,null,{"$f":"Herbstfrühjahr!I43","v":3.3131958597950888},{"$f":"Herbstfrühjahr!I44","v":28.162164808258254},null,"Billig VRK",null,null,{"$f":"Winter!I43","v":1.0943066407502651},{"$f":"Winter!I44","v":8.2072998056269881}]
[null,"im Sommer wird Azimut -70 bis+70 schneller erreicht !",null,null,null,null,null,"im Frühj.Herbst wird Azimut -70 bis+70 langsamer erreicht !",null,null,null,null,null,"im Winter wird Azimut -70 bis+70 gar nicht erreicht ! (nur bis ~50°)"]

{"sheet":"Maxpeak","index":5,"n_rows":48,"n_cols":9,"rows_kept":48,"cut":false,"hidden":false,"merged":[[0,0,0,8],[36,0,36,1],[10,0,10,2],[1,0,4,1],[13,0,13,1],[11,0,11,2],[9,0,9,1]]}
["Nachbildung der Max.Peak Diagramme lt. Prüfberichte (SPF usw.) mit Originaldarstellung nach Modulfläche und variabel auswählbarer Fläche (zum Vergleich zu anderen Kollektoren)"]
["allgemeine Eingaben",null,"Infos > ",{"$f":"Herbstfrühjahr!D2","v":0},{"$f":"Herbstfrühjahr!E2","v":0},{"$f":"Herbstfrühjahr!F2","v":0},{"$f":"Herbstfrühjahr!G2","v":0},{"$f":"Herbstfrühjahr!H2","v":0},{"$f":"Herbstfrühjahr!I2","v":0}]
[null,null,"Kollektor > ",{"$f":"Herbstfrühjahr!D3","v":"SolRose 26"},{"$f":"Herbstfrühjahr!E3","v":"Synergie 210"},{"$f":"Herbstfrühjahr!F3","v":"Sunex AMX 2,85"},{"$f":"Herbstfrühjahr!G3","v":"Sunex 2,0"},{"$f":"Herbstfrühjahr!H3","v":"Star Azzurro CPC"},{"$f":"Herbstfrühjahr!I3","v":"Billig VRK"}]
[null,null,"Bruttofl.(m²)",{"$f":"Herbstfrühjahr!D4","v":2.6},{"$f":"Herbstfrühjahr!E4","v":2.0699999999999998},{"$f":"Herbstfrühjahr!F4","v":2.87},{"$f":"Herbstfrühjahr!G4","v":2.0299999999999998},{"$f":"Herbstfrühjahr!H4","v":3.92},{"$f":"Herbstfrühjahr!I4","v":4.18}]
[null,null,"Aperturfl. (m²)",{"$f":"Herbstfrühjahr!D5","v":2.4700000000000002},{"$f":"Herbstfrühjahr!E5","v":1.92},{"$f":"Herbstfrühjahr!F5","v":2.67},{"$f":"Herbstfrühjahr!G5","v":1.84},{"$f":"Herbstfrühjahr!H5","v":3.47},{"$f":"Herbstfrühjahr!I5","v":2.84}]
[" Gesamtfläche (m²)",{"$f":"Eingaben!B6","v":10.46},"η0",{"$f":"Herbstfrühjahr!D6","v":0.81},{"$f":"Herbstfrühjahr!E6","v":0.78500000000000003},{"$f":"Herbstfrühjahr!F6","v":0.82},{"$f":"Herbstfrühjahr!G6","v":0.8},{"$f":"Herbstfrühjahr!H6","v":0.64},{"$f":"Herbstfrühjahr!I6","v":0.65400000000000003}]
[null,null,"a1",{"$f":"Herbstfrühjahr!D7","v":3.36},{"$f":"Herbstfrühjahr!E7","v":3.722},{"$f":"Herbstfrühjahr!F7","v":3.29},{"$f":"Herbstfrühjahr!G7","v":4.16},{"$f":"Herbstfrühjahr!H7","v":0.749},{"$f":"Herbstfrühjahr!I7","v":1.82}]
[null,null,"a2",{"$f":"Herbstfrühjahr!D8","v":1.41E-2},{"$f":"Herbstfrühjahr!E8","v":1.2E-2},{"$f":"Herbstfrühjahr!F8","v":2.3E-2},{"$f":"Herbstfrühjahr!G8","v":4.0000000000000001E-3},{"$f":"Herbstfrühjahr!H8","v":5.0000000000000001E-3},{"$f":"Herbstfrühjahr!I8","v":6.6E-3}]
["Strahlung   Direkt",1000,"Bruttoflächenanteil (%) > ",{"$f":"IF(D5>0,D5/(D4/100),\"\")","v":95},{"$f":"IF(E5>0,E5/(E4/100),\"\")","v":92.753623188405797},93.031358885017426,90.640394088669964,88.520408163265316,67.942583732057415]
[null,null,"Wirkungsgrad bei  Diff.0  (%) > ",{"$f":"($D$6-$D$7*(0/1000)-$D$8*1000*((0/1000*0/1000)))*100","v":81},{"$f":"($E$6-$E$7*(0/1000)-$E$8*1000*((0/1000*0/1000)))*100","v":78.5},{"$f":"($F$6-$F$7*(0/1000)-$F$8*1000*((0/1000*0/1000)))*100","v":82},{"$f":"($G$6-$G$7*(0/1000)-$G$8*1000*((0/1000*0/1000)))*100","v":80},{"$f":"($H$6-$H$7*(0/1000)-$H$8*1000*((0/1000*0/1000)))*100","v":64},{"$f":"($I$6-$I$7*(0/1000)-$I$8*1000*((0/1000*0/1000)))*100","v":65.400000000000006}]
["max. Peak nach eingestellter Gesamtfläche in W (gleiche Flächen !) > ",null,null,{"$f":"IF(D26>0,D26*1000,\"\")","v":8048.97},{"$f":"IF(E26>0,E26*1000,\"\")","v":7616.0927536231884},7979.4857142857154,7584.7881773399022,5925.9102040816333,4647.8434449760762]
["max. Peak nach Modulfläche in W (verschiedene Flächen !) > ",null,null,{"$f":"IF(D38>0,D38*1000,\"\")","v":2000.6999999999996},{"$f":"IF(E38>0,E38*1000,\"\")","v":1507.1999999999998},2189.4,1472,2220.8000000000006,1857.3600000000001]
[]
[{"$f":"A37","v":"bei 1000 W/m²"},null,"Diff.",{"$f":"IF(D3>0,D3,\"\")","v":"SolRose 26"},{"$f":"IF(E3>0,E3,\"\")","v":"Synergie 210"},"Sunex AMX 2,85","Sunex 2,0","Star Azzurro CPC","Billig VRK"]
[null,"Diff. ",0,{"$f":"IF(Maxpeak!$B$9>0,($D$6-$D$7*(0/Maxpeak!$B$9)-$D$8*Maxpeak!$B$9*((0/Maxpeak!$B$9*0/Maxpeak!$B$9))),0)","v":0.81},{"$f":"IF(Maxpeak!$B$9>0,($E$6-$E$7*(0/Maxpeak!$B$9)-$E$8*Maxpeak!$B$9*((0/Maxpeak!$B$9*0/Maxpeak!$B$9))),0)","v":0.78500000000000003},{"$f":"IF(Maxpeak!$B$9>0,($F$6-$F$7*(0/Maxpeak!$B$9)-$F$8*Maxpeak!$B$9*((0/Maxpeak!$B$9*0/Maxpeak!$B$9))),0)","v":0.82},{"$f":"IF(Maxpeak!$B$9>0,($G$6-$G$7*(0/Maxpeak!$B$9)-$G$8*Maxpeak!$B$9*((0/Maxpeak!$B$9*0/Maxpeak!$B$9))),0)","v":0.8},{"$f":"IF(Maxpeak!$B$9>0,($H$6-$H$7*(0/Maxpeak!$B$9)-$H$8*Maxpeak!$B$9*((0/Maxpeak!$B$9*0/Maxpeak!$B$9))),0)","v":0.64},{"$f":"IF(Maxpeak!$B$9>0,($I$6-$I$7*(0/Maxpeak!$B$9)-$I$8*Maxpeak!$B$9*((0/Maxpeak!$B$9*0/Maxpeak!$B$9))),0)","v":0.65400000000000003}]
[null,"Diff. ",10,{"$f":"IF(Maxpeak!$B$9>0,($D$6-$D$7*(10/Maxpeak!$B$9)-$D$8*Maxpeak!$B$9*((10/Maxpeak!$B$9*10/Maxpeak!$B$9))),0)","v":0.77499000000000007},{"$f":"IF(Maxpeak!$B$9>0,($E$6-$E$7*(10/Maxpeak!$B$9)-$E$8*Maxpeak!$B$9*((10/Maxpeak!$B$9*10/Maxpeak!$B$9))),0)","v":0.74658000000000002},{"$f":"IF(Maxpeak!$B$9>0,($F$6-$F$7*(10/Maxpeak!$B$9)-$F$8*Maxpeak!$B$9*((10/Maxpeak!$B$9*10/Maxpeak!$B$9))),0)","v":0.78479999999999994},{"$f":"IF(Maxpeak!$B$9>0,($G$6-$G$7*(10/Maxpeak!$B$9)-$G$8*Maxpeak!$B$9*((10/Maxpeak!$B$9*10/Maxpeak!$B$9))),0)","v":0.75800000000000012},{"$f":"IF(Maxpeak!$B$9>0,($H$6-$H$7*(10/Maxpeak!$B$9)-$H$8*Maxpeak!$B$9*((10/Maxpeak!$B$9*10/Maxpeak!$B$9))),0)","v":0.63201000000000007},{"$f":"IF(Maxpeak!$B$9>0,($I$6-$I$7*(10/Maxpeak!$B$9)-$I$8*Maxpeak!$B$9*((10/Maxpeak!$B$9*10/Maxpeak!$B$9))),0)","v":0.63514000000000004}]
[null,"Diff. ",20,{"$f":"IF(Maxpeak!$B$9>0,($D$6-$D$7*(20/Maxpeak!$B$9)-$D$8*Maxpeak!$B$9*((20/Maxpeak!$B$9*20/Maxpeak!$B$9))),0)","v":0.73716000000000004},{"$f":"IF(Maxpeak!$B$9>0,($E$6-$E$7*(20/Maxpeak!$B$9)-$E$8*Maxpeak!$B$9*((20/Maxpeak!$B$9*20/Maxpeak!$B$9))),0)","v":0.70576000000000005},{"$f":"IF(Maxpeak!$B$9>0,($F$6-$F$7*(20/Maxpeak!$B$9)-$F$8*Maxpeak!$B$9*((20/Maxpeak!$B$9*20/Maxpeak!$B$9))),0)","v":0.745},{"$f":"IF(Maxpeak!$B$9>0,($G$6-$G$7*(20/Maxpeak!$B$9)-$G$8*Maxpeak!$B$9*((20/Maxpeak!$B$9*20/Maxpeak!$B$9))),0)","v":0.71519999999999995},{"$f":"IF(Maxpeak!$B$9>0,($H$6-$H$7*(20/Maxpeak!$B$9)-$H$8*Maxpeak!$B$9*((20/Maxpeak!$B$9*20/Maxpeak!$B$9))),0)","v":0.62302000000000002},{"$f":"IF(Maxpeak!$B$9>0,($I$6-$I$7*(20/Maxpeak!$B$9)-$I$8*Maxpeak!$B$9*((20/Maxpeak!$B$9*20/Maxpeak!$B$9))),0)","v":0.61496000000000006}]
[null,"Diff. ",30,{"$f":"IF(Maxpeak!$B$9>0,($D$6-$D$7*(30/Maxpeak!$B$9)-$D$8*Maxpeak!$B$9*((30/Maxpeak!$B$9*30/Maxpeak!$B$9))),0)","v":0.69651000000000007},{"$f":"IF(Maxpeak!$B$9>0,($E$6-$E$7*(30/Maxpeak!$B$9)-$E$8*Maxpeak!$B$9*((30/Maxpeak!$B$9*30/Maxpeak!$B$9))),0)","v":0.66254000000000002},{"$f":"IF(Maxpeak!$B$9>0,($F$6-$F$7*(30/Maxpeak!$B$9)-$F$8*Maxpeak!$B$9*((30/Maxpeak!$B$9*30/Maxpeak!$B$9))),0)","v":0.70059999999999989},{"$f":"IF(Maxpeak!$B$9>0,($G$6-$G$7*(30/Maxpeak!$B$9)-$G$8*Maxpeak!$B$9*((30/Maxpeak!$B$9*30/Maxpeak!$B$9))),0)","v":0.67159999999999997},{"$f":"IF(Maxpeak!$B$9>0,($H$6-$H$7*(30/Maxpeak!$B$9)-$H$8*Maxpeak!$B$9*((30/Maxpeak!$B$9*30/Maxpeak!$B$9))),0)","v":0.61303000000000007},{"$f":"IF(Maxpeak!$B$9>0,($I$6-$I$7*(30/Maxpeak!$B$9)-$I$8*Maxpeak!$B$9*((30/Maxpeak!$B$9*30/Maxpeak!$B$9))),0)","v":0.5934600000000001}]
[null,"Diff. ",40,{"$f":"IF(Maxpeak!$B$9>0,($D$6-$D$7*(40/Maxpeak!$B$9)-$D$8*Maxpeak!$B$9*((40/Maxpeak!$B$9*40/Maxpeak!$B$9))),0)","v":0.65304000000000006},{"$f":"IF(Maxpeak!$B$9>0,($E$6-$E$7*(40/Maxpeak!$B$9)-$E$8*Maxpeak!$B$9*((40/Maxpeak!$B$9*40/Maxpeak!$B$9))),0)","v":0.61692000000000002},{"$f":"IF(Maxpeak!$B$9>0,($F$6-$F$7*(40/Maxpeak!$B$9)-$F$8*Maxpeak!$B$9*((40/Maxpeak!$B$9*40/Maxpeak!$B$9))),0)","v":0.65159999999999996},{"$f":"IF(Maxpeak!$B$9>0,($G$6-$G$7*(40/Maxpeak!$B$9)-$G$8*Maxpeak!$B$9*((40/Maxpeak!$B$9*40/Maxpeak!$B$9))),0)","v":0.62720000000000009},{"$f":"IF(Maxpeak!$B$9>0,($H$6-$H$7*(40/Maxpeak!$B$9)-$H$8*Maxpeak!$B$9*((40/Maxpeak!$B$9*40/Maxpeak!$B$9))),0)","v":0.60204000000000002},{"$f":"IF(Maxpeak!$B$9>0,($I$6-$I$7*(40/Maxpeak!$B$9)-$I$8*Maxpeak!$B$9*((40/Maxpeak!$B$9*40/Maxpeak!$B$9))),0)","v":0.57064000000000004}]
[null,"Diff. ",50,{"$f":"IF(Maxpeak!$B$9>0,($D$6-$D$7*(50/Maxpeak!$B$9)-$D$8*Maxpeak!$B$9*((50/Maxpeak!$B$9*50/Maxpeak!$B$9))),0)","v":0.60675000000000001},{"$f":"IF(Maxpeak!$B$9>0,($E$6-$E$7*(50/Maxpeak!$B$9)-$E$8*Maxpeak!$B$9*((50/Maxpeak!$B$9*50/Maxpeak!$B$9))),0)","v":0.56889999999999996},{"$f":"IF(Maxpeak!$B$9>0,($F$6-$F$7*(50/Maxpeak!$B$9)-$F$8*Maxpeak!$B$9*((50/Maxpeak!$B$9*50/Maxpeak!$B$9))),0)","v":0.59799999999999998},{"$f":"IF(Maxpeak!$B$9>0,($G$6-$G$7*(50/Maxpeak!$B$9)-$G$8*Maxpeak!$B$9*((50/Maxpeak!$B$9*50/Maxpeak!$B$9))),0)","v":0.58200000000000007},{"$f":"IF(Maxpeak!$B$9>0,($H$6-$H$7*(50/Maxpeak!$B$9)-$H$8*Maxpeak!$B$9*((50/Maxpeak!$B$9*50/Maxpeak!$B$9))),0)","v":0.59005000000000007},{"$f":"IF(Maxpeak!$B$9>0,($I$6-$I$7*(50/Maxpeak!$B$9)-$I$8*Maxpeak!$B$9*((50/Maxpeak!$B$9*50/Maxpeak!$B$9))),0)","v":0.5465000000000001}]
[null,"Diff. ",60,{"$f":"IF(Maxpeak!$B$9>0,($D$6-$D$7*(60/Maxpeak!$B$9)-$D$8*Maxpeak!$B$9*((60/Maxpeak!$B$9*60/Maxpeak!$B$9))),0)","v":0.55764000000000002},{"$f":"IF(Maxpeak!$B$9>0,($E$6-$E$7*(60/Maxpeak!$B$9)-$E$8*Maxpeak!$B$9*((60/Maxpeak!$B$9*60/Maxpeak!$B$9))),0)","v":0.51848000000000005},{"$f":"IF(Maxpeak!$B$9>0,($F$6-$F$7*(60/Maxpeak!$B$9)-$F$8*Maxpeak!$B$9*((60/Maxpeak!$B$9*60/Maxpeak!$B$9))),0)","v":0.53979999999999995},{"$f":"IF(Maxpeak!$B$9>0,($G$6-$G$7*(60/Maxpeak!$B$9)-$G$8*Maxpeak!$B$9*((60/Maxpeak!$B$9*60/Maxpeak!$B$9))),0)","v":0.53600000000000003},{"$f":"IF(Maxpeak!$B$9>0,($H$6-$H$7*(60/Maxpeak!$B$9)-$H$8*Maxpeak!$B$9*((60/Maxpeak!$B$9*60/Maxpeak!$B$9))),0)","v":0.57706000000000002},{"$f":"IF(Maxpeak!$B$9>0,($I$6-$I$7*(60/Maxpeak!$B$9)-$I$8*Maxpeak!$B$9*((60/Maxpeak!$B$9*60/Maxpeak!$B$9))),0)","v":0.52104000000000006}]
[null,"Diff. ",70,{"$f":"IF(Maxpeak!$B$9>0,($D$6-$D$7*(70/Maxpeak!$B$9)-$D$8*Maxpeak!$B$9*((70/Maxpeak!$B$9*70/Maxpeak!$B$9))),0)","v":0.50570999999999999},{"$f":"IF(Maxpeak!$B$9>0,($E$6-$E$7*(70/Maxpeak!$B$9)-$E$8*Maxpeak!$B$9*((70/Maxpeak!$B$9*70/Maxpeak!$B$9))),0)","v":0.46565999999999991},{"$f":"IF(Maxpeak!$B$9>0,($F$6-$F$7*(70/Maxpeak!$B$9)-$F$8*Maxpeak!$B$9*((70/Maxpeak!$B$9*70/Maxpeak!$B$9))),0)","v":0.47699999999999987},{"$f":"IF(Maxpeak!$B$9>0,($G$6-$G$7*(70/Maxpeak!$B$9)-$G$8*Maxpeak!$B$9*((70/Maxpeak!$B$9*70/Maxpeak!$B$9))),0)","v":0.48920000000000002},{"$f":"IF(Maxpeak!$B$9>0,($H$6-$H$7*(70/Maxpeak!$B$9)-$H$8*Maxpeak!$B$9*((70/Maxpeak!$B$9*70/Maxpeak!$B$9))),0)","v":0.56307000000000007},{"$f":"IF(Maxpeak!$B$9>0,($I$6-$I$7*(70/Maxpeak!$B$9)-$I$8*Maxpeak!$B$9*((70/Maxpeak!$B$9*70/Maxpeak!$B$9))),0)","v":0.49425999999999998}]
[null,"Diff. ",80,{"$f":"IF(Maxpeak!$B$9>0,($D$6-$D$7*(80/Maxpeak!$B$9)-$D$8*Maxpeak!$B$9*((80/Maxpeak!$B$9*80/Maxpeak!$B$9))),0)","v":0.45096000000000014},{"$f":"IF(Maxpeak!$B$9>0,($E$6-$E$7*(80/Maxpeak!$B$9)-$E$8*Maxpeak!$B$9*((80/Maxpeak!$B$9*80/Maxpeak!$B$9))),0)","v":0.41044000000000003},{"$f":"IF(Maxpeak!$B$9>0,($F$6-$F$7*(80/Maxpeak!$B$9)-$F$8*Maxpeak!$B$9*((80/Maxpeak!$B$9*80/Maxpeak!$B$9))),0)","v":0.40959999999999996},{"$f":"IF(Maxpeak!$B$9>0,($G$6-$G$7*(80/Maxpeak!$B$9)-$G$8*Maxpeak!$B$9*((80/Maxpeak!$B$9*80/Maxpeak!$B$9))),0)","v":0.44159999999999999},{"$f":"IF(Maxpeak!$B$9>0,($H$6-$H$7*(80/Maxpeak!$B$9)-$H$8*Maxpeak!$B$9*((80/Maxpeak!$B$9*80/Maxpeak!$B$9))),0)","v":0.54808000000000001},{"$f":"IF(Maxpeak!$B$9>0,($I$6-$I$7*(80/Maxpeak!$B$9)-$I$8*Maxpeak!$B$9*((80/Maxpeak!$B$9*80/Maxpeak!$B$9))),0)","v":0.46615999999999996}]
[null,"Diff. ",90,{"$f":"IF(Maxpeak!$B$9>0,($D$6-$D$7*(90/Maxpeak!$B$9)-$D$8*Maxpeak!$B$9*((90/Maxpeak!$B$9*90/Maxpeak!$B$9))),0)","v":0.39339000000000007},{"$f":"IF(Maxpeak!$B$9>0,($E$6-$E$7*(90/Maxpeak!$B$9)-$E$8*Maxpeak!$B$9*((90/Maxpeak!$B$9*90/Maxpeak!$B$9))),0)","v":0.35282000000000002},{"$f":"IF(Maxpeak!$B$9>0,($F$6-$F$7*(90/Maxpeak!$B$9)-$F$8*Maxpeak!$B$9*((90/Maxpeak!$B$9*90/Maxpeak!$B$9))),0)","v":0.33760000000000001},{"$f":"IF(Maxpeak!$B$9>0,($G$6-$G$7*(90/Maxpeak!$B$9)-$G$8*Maxpeak!$B$9*((90/Maxpeak!$B$9*90/Maxpeak!$B$9))),0)","v":0.39320000000000005},{"$f":"IF(Maxpeak!$B$9>0,($H$6-$H$7*(90/Maxpeak!$B$9)-$H$8*Maxpeak!$B$9*((90/Maxpeak!$B$9*90/Maxpeak!$B$9))),0)","v":0.53209000000000006},{"$f":"IF(Maxpeak!$B$9>0,($I$6-$I$7*(90/Maxpeak!$B$9)-$I$8*Maxpeak!$B$9*((90/Maxpeak!$B$9*90/Maxpeak!$B$9))),0)","v":0.43674000000000002}]
[null,"Diff. ",100,{"$f":"IF(Maxpeak!$B$9>0,($D$6-$D$7*(100/Maxpeak!$B$9)-$D$8*Maxpeak!$B$9*((100/Maxpeak!$B$9*100/Maxpeak!$B$9))),0)","v":0.33300000000000007},{"$f":"IF(Maxpeak!$B$9>0,($E$6-$E$7*(100/Maxpeak!$B$9)-$E$8*Maxpeak!$B$9*((100/Maxpeak!$B$9*100/Maxpeak!$B$9))),0)","v":0.2928},{"$f":"IF(Maxpeak!$B$9>0,($F$6-$F$7*(100/Maxpeak!$B$9)-$F$8*Maxpeak!$B$9*((100/Maxpeak!$B$9*100/Maxpeak!$B$9))),0)","v":0.2609999999999999},{"$f":"IF(Maxpeak!$B$9>0,($G$6-$G$7*(100/Maxpeak!$B$9)-$G$8*Maxpeak!$B$9*((100/Maxpeak!$B$9*100/Maxpeak!$B$9))),0)","v":0.34400000000000003},{"$f":"IF(Maxpeak!$B$9>0,($H$6-$H$7*(100/Maxpeak!$B$9)-$H$8*Maxpeak!$B$9*((100/Maxpeak!$B$9*100/Maxpeak!$B$9))),0)","v":0.5151},{"$f":"IF(Maxpeak!$B$9>0,($I$6-$I$7*(100/Maxpeak!$B$9)-$I$8*Maxpeak!$B$9*((100/Maxpeak!$B$9*100/Maxpeak!$B$9))),0)","v":0.40599999999999997}]
["pro eingetragene m²","KW",0,{"$f":"IF(D15>0,(Maxpeak!$B$9*D15*Maxpeak!$B$6/1000)*$D$5/$D$4,0)","v":8.0489700000000006},{"$f":"IF(E15>0,(Maxpeak!$B$9*E15*Maxpeak!$B$6/1000)*$E$5/$E$4,0)","v":7.6160927536231888},{"$f":"IF(F15>0,(Maxpeak!$B$9*F15*Maxpeak!$B$6/1000)*$F$5/$F$4,0)","v":7.9794857142857154},{"$f":"IF(G15>0,(Maxpeak!$B$9*G15*Maxpeak!$B$6/1000)*$G$5/$G$4,0)","v":7.5847881773399024},{"$f":"IF(H15>0,(Maxpeak!$B$9*H15*Maxpeak!$B$6/1000)*$H$5/$H$4,0)","v":5.9259102040816334},{"$f":"IF(I15>0,(Maxpeak!$B$9*I15*Maxpeak!$B$6/1000)*$I$5/$I$4,0)","v":4.6478434449760764}]
["pro eingetragene m²","KW",10,{"$f":"IF(D16>0,(Maxpeak!$B$9*D16*Maxpeak!$B$6/1000)*$D$5/$D$4,0)","v":7.7010756300000018},{"$f":"IF(E16>0,(Maxpeak!$B$9*E16*Maxpeak!$B$6/1000)*$E$5/$E$4,0)","v":7.2433408000000012},{"$f":"IF(F16>0,(Maxpeak!$B$9*F16*Maxpeak!$B$6/1000)*$F$5/$F$4,0)","v":7.636951693379789},{"$f":"IF(G16>0,(Maxpeak!$B$9*G16*Maxpeak!$B$6/1000)*$G$5/$G$4,0)","v":7.186586798029559},{"$f":"IF(H16>0,(Maxpeak!$B$9*H16*Maxpeak!$B$6/1000)*$H$5/$H$4,0)","v":5.8519289188775527},{"$f":"IF(I16>0,(Maxpeak!$B$9*I16*Maxpeak!$B$6/1000)*$I$5/$I$4,0)","v":4.513809305263158}]
["pro eingetragene m²","KW",20,{"$f":"IF(D17>0,(Maxpeak!$B$9*D17*Maxpeak!$B$6/1000)*$D$5/$D$4,0)","v":7.3251589200000016},{"$f":"IF(E17>0,(Maxpeak!$B$9*E17*Maxpeak!$B$6/1000)*$E$5/$E$4,0)","v":6.8473039768115962},{"$f":"IF(F17>0,(Maxpeak!$B$9*F17*Maxpeak!$B$6/1000)*$F$5/$F$4,0)","v":7.2496547038327535},{"$f":"IF(G17>0,(Maxpeak!$B$9*G17*Maxpeak!$B$6/1000)*$G$5/$G$4,0)","v":6.7808006305418731},{"$f":"IF(H17>0,(Maxpeak!$B$9*H17*Maxpeak!$B$6/1000)*$H$5/$H$4,0)","v":5.7686883989795916},{"$f":"IF(I17>0,(Maxpeak!$B$9*I17*Maxpeak!$B$6/1000)*$I$5/$I$4,0)","v":4.3703941971291869}]
["pro eingetragene m²","KW",30,{"$f":"IF(D18>0,(Maxpeak!$B$9*D18*Maxpeak!$B$6/1000)*$D$5/$D$4,0)","v":6.9212198700000016},{"$f":"IF(E18>0,(Maxpeak!$B$9*E18*Maxpeak!$B$6/1000)*$E$5/$E$4,0)","v":6.4279822840579719},{"$f":"IF(F18>0,(Maxpeak!$B$9*F18*Maxpeak!$B$6/1000)*$F$5/$F$4,0)","v":6.8175947456445982},{"$f":"IF(G18>0,(Maxpeak!$B$9*G18*Maxpeak!$B$6/1000)*$G$5/$G$4,0)","v":6.3674296748768491},{"$f":"IF(H18>0,(Maxpeak!$B$9*H18*Maxpeak!$B$6/1000)*$H$5/$H$4,0)","v":5.6761886443877572},{"$f":"IF(I18>0,(Maxpeak!$B$9*I18*Maxpeak!$B$6/1000)*$I$5/$I$4,0)","v":4.2175981205741646}]
["pro eingetragene m²","KW",40,{"$f":"IF(D19>0,(Maxpeak!$B$9*D19*Maxpeak!$B$6/1000)*$D$5/$D$4,0)","v":6.4892584800000028},{"$f":"IF(E19>0,(Maxpeak!$B$9*E19*Maxpeak!$B$6/1000)*$E$5/$E$4,0)","v":5.9853757217391319},{"$f":"IF(F19>0,(Maxpeak!$B$9*F19*Maxpeak!$B$6/1000)*$F$5/$F$4,0)","v":6.3407718188153313},{"$f":"IF(G19>0,(Maxpeak!$B$9*G19*Maxpeak!$B$6/1000)*$G$5/$G$4,0)","v":5.9464739310344843},{"$f":"IF(H19>0,(Maxpeak!$B$9*H19*Maxpeak!$B$6/1000)*$H$5/$H$4,0)","v":5.5744296551020414},{"$f":"IF(I19>0,(Maxpeak!$B$9*I19*Maxpeak!$B$6/1000)*$I$5/$I$4,0)","v":4.055421075598086}]
["pro eingetragene m²","KW",50,{"$f":"IF(D20>0,(Maxpeak!$B$9*D20*Maxpeak!$B$6/1000)*$D$5/$D$4,0)","v":6.0292747500000008},{"$f":"IF(E20>0,(Maxpeak!$B$9*E20*Maxpeak!$B$6/1000)*$E$5/$E$4,0)","v":5.5194842898550727},{"$f":"IF(F20>0,(Maxpeak!$B$9*F20*Maxpeak!$B$6/1000)*$F$5/$F$4,0)","v":5.8191859233449481},{"$f":"IF(G20>0,(Maxpeak!$B$9*G20*Maxpeak!$B$6/1000)*$G$5/$G$4,0)","v":5.5179333990147805},{"$f":"IF(H20>0,(Maxpeak!$B$9*H20*Maxpeak!$B$6/1000)*$H$5/$H$4,0)","v":5.4634114311224504},{"$f":"IF(I20>0,(Maxpeak!$B$9*I20*Maxpeak!$B$6/1000)*$I$5/$I$4,0)","v":3.883863062200958}]
["pro eingetragene m²","KW",60,{"$f":"IF(D21>0,(Maxpeak!$B$9*D21*Maxpeak!$B$6/1000)*$D$5/$D$4,0)","v":5.5412686800000008},{"$f":"IF(E21>0,(Maxpeak!$B$9*E21*Maxpeak!$B$6/1000)*$E$5/$E$4,0)","v":5.0303079884057986},{"$f":"IF(F21>0,(Maxpeak!$B$9*F21*Maxpeak!$B$6/1000)*$F$5/$F$4,0)","v":5.2528370592334488},{"$f":"IF(G21>0,(Maxpeak!$B$9*G21*Maxpeak!$B$6/1000)*$G$5/$G$4,0)","v":5.0818080788177351},{"$f":"IF(H21>0,(Maxpeak!$B$9*H21*Maxpeak!$B$6/1000)*$H$5/$H$4,0)","v":5.3431339724489799},{"$f":"IF(I21>0,(Maxpeak!$B$9*I21*Maxpeak!$B$6/1000)*$I$5/$I$4,0)","v":3.7029240803827763}]
["pro eingetragene m²","KW",70,{"$f":"IF(D22>0,(Maxpeak!$B$9*D22*Maxpeak!$B$6/1000)*$D$5/$D$4,0)","v":5.0252402700000003},{"$f":"IF(E22>0,(Maxpeak!$B$9*E22*Maxpeak!$B$6/1000)*$E$5/$E$4,0)","v":4.5178468173913036},{"$f":"IF(F22>0,(Maxpeak!$B$9*F22*Maxpeak!$B$6/1000)*$F$5/$F$4,0)","v":4.6417252264808351},{"$f":"IF(G22>0,(Maxpeak!$B$9*G22*Maxpeak!$B$6/1000)*$G$5/$G$4,0)","v":4.6380979704433516},{"$f":"IF(H22>0,(Maxpeak!$B$9*H22*Maxpeak!$B$6/1000)*$H$5/$H$4,0)","v":5.2135972790816334},{"$f":"IF(I22>0,(Maxpeak!$B$9*I22*Maxpeak!$B$6/1000)*$I$5/$I$4,0)","v":3.5126041301435409}]
["pro eingetragene m²","KW",80,{"$f":"IF(D23>0,(Maxpeak!$B$9*D23*Maxpeak!$B$6/1000)*$D$5/$D$4,0)","v":4.4811895200000027},{"$f":"IF(E23>0,(Maxpeak!$B$9*E23*Maxpeak!$B$6/1000)*$E$5/$E$4,0)","v":3.9821007768115959},{"$f":"IF(F23>0,(Maxpeak!$B$9*F23*Maxpeak!$B$6/1000)*$F$5/$F$4,0)","v":3.9858504250871079},{"$f":"IF(G23>0,(Maxpeak!$B$9*G23*Maxpeak!$B$6/1000)*$G$5/$G$4,0)","v":4.1868030738916264},{"$f":"IF(H23>0,(Maxpeak!$B$9*H23*Maxpeak!$B$6/1000)*$H$5/$H$4,0)","v":5.0748013510204091},{"$f":"IF(I23>0,(Maxpeak!$B$9*I23*Maxpeak!$B$6/1000)*$I$5/$I$4,0)","v":3.3129032114832531}]
["pro eingetragene m²","KW",90,{"$f":"IF(D24>0,(Maxpeak!$B$9*D24*Maxpeak!$B$6/1000)*$D$5/$D$4,0)","v":3.909116430000001},{"$f":"IF(E24>0,(Maxpeak!$B$9*E24*Maxpeak!$B$6/1000)*$E$5/$E$4,0)","v":3.4230698666666672},{"$f":"IF(F24>0,(Maxpeak!$B$9*F24*Maxpeak!$B$6/1000)*$F$5/$F$4,0)","v":3.2852126550522649},{"$f":"IF(G24>0,(Maxpeak!$B$9*G24*Maxpeak!$B$6/1000)*$G$5/$G$4,0)","v":3.7279233891625632},{"$f":"IF(H24>0,(Maxpeak!$B$9*H24*Maxpeak!$B$6/1000)*$H$5/$H$4,0)","v":4.926746188265307},{"$f":"IF(I24>0,(Maxpeak!$B$9*I24*Maxpeak!$B$6/1000)*$I$5/$I$4,0)","v":3.1038213244019142}]
["pro eingetragene m²","KW",100,{"$f":"IF(D25>0,(Maxpeak!$B$9*D25*Maxpeak!$B$6/1000)*$D$5/$D$4,0)","v":3.3090210000000009},{"$f":"IF(E25>0,(Maxpeak!$B$9*E25*Maxpeak!$B$6/1000)*$E$5/$E$4,0)","v":2.8407540869565224},{"$f":"IF(F25>0,(Maxpeak!$B$9*F25*Maxpeak!$B$6/1000)*$F$5/$F$4,0)","v":2.5398119163763058},{"$f":"IF(G25>0,(Maxpeak!$B$9*G25*Maxpeak!$B$6/1000)*$G$5/$G$4,0)","v":3.2614589162561582},{"$f":"IF(H25>0,(Maxpeak!$B$9*H25*Maxpeak!$B$6/1000)*$H$5/$H$4,0)","v":4.769431790816328},{"$f":"IF(I25>0,(Maxpeak!$B$9*I25*Maxpeak!$B$6/1000)*$I$5/$I$4,0)","v":2.8853584688995215}]
[{"$f":"\"bei \"&Maxpeak!B9 &\" W/m²\"","v":"bei 1000 W/m²"},null,"Diff.",{"$f":"D14","v":"SolRose 26"},{"$f":"E14","v":"Synergie 210"},"Sunex AMX 2,85","Sunex 2,0","Star Azzurro CPC","Billig VRK"]
["pro Modulbruttofläche","KW",0,{"$f":"IF(D15>0,(Maxpeak!$B$9*D15*$D$4/1000)*$D$5/$D$4,0)","v":2.0006999999999997},{"$f":"IF(E15>0,(Maxpeak!$B$9*E15*$E$4/1000)*$E$5/$E$4,0)","v":1.5071999999999999},{"$f":"IF(F15>0,(Maxpeak!$B$9*F15*$F$4/1000)*$F$5/$F$4,0)","v":2.1894},{"$f":"IF(G15>0,(Maxpeak!$B$9*G15*$G$4/1000)*$G$5/$G$4,0)","v":1.472},{"$f":"IF(H15>0,(Maxpeak!$B$9*H15*$H$4/1000)*$H$5/$H$4,0)","v":2.2208000000000006},{"$f":"IF(I15>0,(Maxpeak!$B$9*I15*$I$4/1000)*$I$5/$I$4,0)","v":1.8573600000000001}]
["pro Modulbruttofläche","KW",10,{"$f":"IF(D16>0,(Maxpeak!$B$9*D16*$D$4/1000)*$D$5/$D$4,0)","v":1.9142253000000005},{"$f":"IF(E16>0,(Maxpeak!$B$9*E16*$E$4/1000)*$E$5/$E$4,0)","v":1.4334335999999999},{"$f":"IF(F16>0,(Maxpeak!$B$9*F16*$F$4/1000)*$F$5/$F$4,0)","v":2.0954159999999997},{"$f":"IF(G16>0,(Maxpeak!$B$9*G16*$G$4/1000)*$G$5/$G$4,0)","v":1.3947200000000002},{"$f":"IF(H16>0,(Maxpeak!$B$9*H16*$H$4/1000)*$H$5/$H$4,0)","v":2.1930747000000004},{"$f":"IF(I16>0,(Maxpeak!$B$9*I16*$I$4/1000)*$I$5/$I$4,0)","v":1.8037976}]
["pro Modulbruttofläche","KW",20,{"$f":"IF(D17>0,(Maxpeak!$B$9*D17*$D$4/1000)*$D$5/$D$4,0)","v":1.8207852000000002},{"$f":"IF(E17>0,(Maxpeak!$B$9*E17*$E$4/1000)*$E$5/$E$4,0)","v":1.3550592000000001},{"$f":"IF(F17>0,(Maxpeak!$B$9*F17*$F$4/1000)*$F$5/$F$4,0)","v":1.98915},{"$f":"IF(G17>0,(Maxpeak!$B$9*G17*$G$4/1000)*$G$5/$G$4,0)","v":1.315968},{"$f":"IF(H17>0,(Maxpeak!$B$9*H17*$H$4/1000)*$H$5/$H$4,0)","v":2.1618794000000001},{"$f":"IF(I17>0,(Maxpeak!$B$9*I17*$I$4/1000)*$I$5/$I$4,0)","v":1.7464864000000002}]
["pro Modulbruttofläche","KW",30,{"$f":"IF(D18>0,(Maxpeak!$B$9*D18*$D$4/1000)*$D$5/$D$4,0)","v":1.7203797000000003},{"$f":"IF(E18>0,(Maxpeak!$B$9*E18*$E$4/1000)*$E$5/$E$4,0)","v":1.2720768},{"$f":"IF(F18>0,(Maxpeak!$B$9*F18*$F$4/1000)*$F$5/$F$4,0)","v":1.8706019999999999},{"$f":"IF(G18>0,(Maxpeak!$B$9*G18*$G$4/1000)*$G$5/$G$4,0)","v":1.2357440000000002},{"$f":"IF(H18>0,(Maxpeak!$B$9*H18*$H$4/1000)*$H$5/$H$4,0)","v":2.1272141000000002},{"$f":"IF(I18>0,(Maxpeak!$B$9*I18*$I$4/1000)*$I$5/$I$4,0)","v":1.6854264000000005}]
["pro Modulbruttofläche","KW",40,{"$f":"IF(D19>0,(Maxpeak!$B$9*D19*$D$4/1000)*$D$5/$D$4,0)","v":1.6130088000000002},{"$f":"IF(E19>0,(Maxpeak!$B$9*E19*$E$4/1000)*$E$5/$E$4,0)","v":1.1844864000000002},{"$f":"IF(F19>0,(Maxpeak!$B$9*F19*$F$4/1000)*$F$5/$F$4,0)","v":1.7397719999999999},{"$f":"IF(G19>0,(Maxpeak!$B$9*G19*$G$4/1000)*$G$5/$G$4,0)","v":1.1540480000000002},{"$f":"IF(H19>0,(Maxpeak!$B$9*H19*$H$4/1000)*$H$5/$H$4,0)","v":2.0890787999999998},{"$f":"IF(I19>0,(Maxpeak!$B$9*I19*$I$4/1000)*$I$5/$I$4,0)","v":1.6206175999999999}]
["pro Modulbruttofläche","KW",50,{"$f":"IF(D20>0,(Maxpeak!$B$9*D20*$D$4/1000)*$D$5/$D$4,0)","v":1.4986725000000001},{"$f":"IF(E20>0,(Maxpeak!$B$9*E20*$E$4/1000)*$E$5/$E$4,0)","v":1.0922879999999999},{"$f":"IF(F20>0,(Maxpeak!$B$9*F20*$F$4/1000)*$F$5/$F$4,0)","v":1.5966599999999997},{"$f":"IF(G20>0,(Maxpeak!$B$9*G20*$G$4/1000)*$G$5/$G$4,0)","v":1.0708800000000003},{"$f":"IF(H20>0,(Maxpeak!$B$9*H20*$H$4/1000)*$H$5/$H$4,0)","v":2.0474735000000002},{"$f":"IF(I20>0,(Maxpeak!$B$9*I20*$I$4/1000)*$I$5/$I$4,0)","v":1.5520600000000002}]
["pro Modulbruttofläche","KW",60,{"$f":"IF(D21>0,(Maxpeak!$B$9*D21*$D$4/1000)*$D$5/$D$4,0)","v":1.3773708},{"$f":"IF(E21>0,(Maxpeak!$B$9*E21*$E$4/1000)*$E$5/$E$4,0)","v":0.99548159999999997},{"$f":"IF(F21>0,(Maxpeak!$B$9*F21*$F$4/1000)*$F$5/$F$4,0)","v":1.4412659999999997},{"$f":"IF(G21>0,(Maxpeak!$B$9*G21*$G$4/1000)*$G$5/$G$4,0)","v":0.98624000000000012},{"$f":"IF(H21>0,(Maxpeak!$B$9*H21*$H$4/1000)*$H$5/$H$4,0)","v":2.0023982000000005},{"$f":"IF(I21>0,(Maxpeak!$B$9*I21*$I$4/1000)*$I$5/$I$4,0)","v":1.4797536000000002}]
["pro Modulbruttofläche","KW",70,{"$f":"IF(D22>0,(Maxpeak!$B$9*D22*$D$4/1000)*$D$5/$D$4,0)","v":1.2491037},{"$f":"IF(E22>0,(Maxpeak!$B$9*E22*$E$4/1000)*$E$5/$E$4,0)","v":0.89406719999999984},{"$f":"IF(F22>0,(Maxpeak!$B$9*F22*$F$4/1000)*$F$5/$F$4,0)","v":1.2735899999999998},{"$f":"IF(G22>0,(Maxpeak!$B$9*G22*$G$4/1000)*$G$5/$G$4,0)","v":0.90012800000000015},{"$f":"IF(H22>0,(Maxpeak!$B$9*H22*$H$4/1000)*$H$5/$H$4,0)","v":1.9538529000000004},{"$f":"IF(I22>0,(Maxpeak!$B$9*I22*$I$4/1000)*$I$5/$I$4,0)","v":1.4036983999999999}]
["pro Modulbruttofläche","KW",80,{"$f":"IF(D23>0,(Maxpeak!$B$9*D23*$D$4/1000)*$D$5/$D$4,0)","v":1.1138712000000004},{"$f":"IF(E23>0,(Maxpeak!$B$9*E23*$E$4/1000)*$E$5/$E$4,0)","v":0.7880448000000001},{"$f":"IF(F23>0,(Maxpeak!$B$9*F23*$F$4/1000)*$F$5/$F$4,0)","v":1.0936319999999999},{"$f":"IF(G23>0,(Maxpeak!$B$9*G23*$G$4/1000)*$G$5/$G$4,0)","v":0.81254400000000004},{"$f":"IF(H23>0,(Maxpeak!$B$9*H23*$H$4/1000)*$H$5/$H$4,0)","v":1.9018376000000006},{"$f":"IF(I23>0,(Maxpeak!$B$9*I23*$I$4/1000)*$I$5/$I$4,0)","v":1.3238943999999999}]
["pro Modulbruttofläche","KW",90,{"$f":"IF(D24>0,(Maxpeak!$B$9*D24*$D$4/1000)*$D$5/$D$4,0)","v":0.97167330000000041},{"$f":"IF(E24>0,(Maxpeak!$B$9*E24*$E$4/1000)*$E$5/$E$4,0)","v":0.67741440000000008},{"$f":"IF(F24>0,(Maxpeak!$B$9*F24*$F$4/1000)*$F$5/$F$4,0)","v":0.90139199999999997},{"$f":"IF(G24>0,(Maxpeak!$B$9*G24*$G$4/1000)*$G$5/$G$4,0)","v":0.72348800000000013},{"$f":"IF(H24>0,(Maxpeak!$B$9*H24*$H$4/1000)*$H$5/$H$4,0)","v":1.8463523000000002},{"$f":"IF(I24>0,(Maxpeak!$B$9*I24*$I$4/1000)*$I$5/$I$4,0)","v":1.2403415999999998}]
["pro Modulbruttofläche","KW",100,{"$f":"IF(D25>0,(Maxpeak!$B$9*D25*$D$4/1000)*$D$5/$D$4,0)","v":0.82251000000000019},{"$f":"IF(E25>0,(Maxpeak!$B$9*E25*$E$4/1000)*$E$5/$E$4,0)","v":0.56217600000000001},{"$f":"IF(F25>0,(Maxpeak!$B$9*F25*$F$4/1000)*$F$5/$F$4,0)","v":0.69686999999999966},{"$f":"IF(G25>0,(Maxpeak!$B$9*G25*$G$4/1000)*$G$5/$G$4,0)","v":0.63296000000000008},{"$f":"IF(H25>0,(Maxpeak!$B$9*H25*$H$4/1000)*$H$5/$H$4,0)","v":1.7873970000000001},{"$f":"IF(I25>0,(Maxpeak!$B$9*I25*$I$4/1000)*$I$5/$I$4,0)","v":1.1530400000000001}]

{"sheet":"Jahreshochrechnung","index":6,"n_rows":37,"n_cols":9,"rows_kept":37,"cut":false,"hidden":true,"merged":[[1,3,1,8],[1,0,1,1],[0,0,0,8],[21,3,21,8],[13,2,16,2],[8,2,11,2],[3,2,6,2],[20,0,20,8]]}
["Solartirol / Jahressimulation (fixe Diff.)  Tagesdaten nach Praxisdaten in Würzburg hochgerechnet (Anzahl der guten mittleren schlechten Tage in Sommer Frühj.Herbst Winter aus Praxisdaten entnommen)"]
["eingetragene Gesamtfläche (m²) >",null,{"$f":"Eingaben!B6","v":10.46},{"$f":"\"Monatsertäge bei eingetragener Fläche \"&C2&\" m² im Tagesverlauf von Azimut -70° bis +70°\"","v":"Monatsertäge bei eingetragener Fläche 10,46 m² im Tagesverlauf von Azimut -70° bis +70°"}]
[{"$f":"A23","v":"Sommer Diff. 35"},"Anzahl (Tage)",null,{"$f":"D23","v":"SolRose 26"},{"$f":"E23","v":"Synergie 210"},"Sunex AMX 2,85","Sunex 2,0","Star Azzurro CPC","Billig VRK"]
["Sommer sonniger Tag",66.7,"überwiegend viel Strahlung (tlw. nicht nutzbar)",{"$f":"D24*$B$4","v":2158.2430149549032},{"$f":"E24*$B$4","v":2011.4666155291602},2138.8402317910331,1998.1017806565799,2004.0736094040583,1660.2029681492284]
["Sommer leicht bewölkt",14.7,null,{"$f":"D25*$B$5","v":329.69636535527155},{"$f":"E25*$B$5","v":303.69135138544704},324.94636074110139,300.98249506365795,324.56624812581009,261.43994671518186]
["Sommer mittel bewölkt",8.3000000000000007,null,{"$f":"D26*$B$6","v":103.74320940959744},{"$f":"E26*$B$6","v":92.641532621731898},100.79369790506611,91.245642409891147,117.13451454524805,88.639530906073773]
["Sommer stark bewölkt",2.2999999999999998,null,{"$f":"D27*$B$7","v":5.8925848003028012},{"$f":"E27*$B$7","v":4.0082377358293346},5.0960614571998182,3.6983046269929725,13.081214102053432,7.6740038216854352]
[{"$f":"A28","v":"Frühjahr/Herbst Diff. 32"},{"$f":"SUM(B4:B7)","v":92},"Summe Sommer (kWh)>",{"$f":"SUM(D4:D7)","v":2597.5751745200751},{"$f":"SUM(E4:E7)","v":2411.8077372721687},2569.6763518944003,2394.0282227571215,2458.8555861771697,2017.9564495921693]
["Frühjahr/Herbst sonniger Tag",99.3,"rel.viel Strahlung (gut nutzbar)",{"$f":"D29*$B$9","v":3709.9306975052018},{"$f":"E29*$B$9","v":3424.664429714288},3654.8742351549886,3391.03786768702,3430.2044307520077,2796.5029654600444]
["Frühjahr/Herbst leicht bewölkt",22,null,{"$f":"D30*$B$10","v":563.72556113378562},{"$f":"E30*$B$10","v":512.79489674086028},551.90007703171636,505.89011184606375,556.99611276980909,439.33730503134041]
["Frühjahr/Herbst mittel bewölkt",23.7,null,{"$f":"D31*$B$11","v":329.12060788085392},{"$f":"E31*$B$11","v":288.02575630235276},316.78242898682265,281.86282118875943,381.38416795436058,279.1288876118038]
["Frühjahr/Herbst stark bewölkt",38,null,{"$f":"D32*$B$12","v":104.88344501640324},{"$f":"E32*$B$12","v":70.223971889017236},91.544502554539108,63.928549062654369,260.91988810740463,140.10441202935959]
[{"$f":"A33","v":"Winter Diff. 28"},{"$f":"SUM(B9:B12)","v":183},"Summe Frühj./Herbst (kWh)>",{"$f":"SUM(D9:D12)","v":4707.6603115362441},{"$f":"SUM(E9:E12)","v":4295.7090546465179},4615.1012437280669,4242.7193497844974,4629.5045995835817,3655.073570132548]
["Winter sonniger Tag",11,"überwiegend wenig Strahlung (tlw. auch schwer nutzbar, bei Vereisung oder Schnee)",{"$f":"D34*$B$14","v":127.73378987770504},{"$f":"E34*$B$14","v":114.8546811996754},124.39267689822438,112.61334638521384,125.9129096481592,90.280297861896869]
["Winter leicht bewölkt",5,null,{"$f":"D35*$B$15","v":37.734352221881259},{"$f":"E35*$B$15","v":33.036777409391313},36.457560832829273,32.096783258482766,41.328775537122468,28.161780047009341]
["Winter mittel bewölkt",16.3,null,{"$f":"D36*$B$16","v":57.901609519729668},{"$f":"E36*$B$16","v":48.107380021328723},55.102100431813589,45.860702145431354,82.883577659766146,50.388859479216883]
["Winter stark bewölkt",58,null,{"$f":"D37*$B$17","v":12.44440519740002},{"$f":"E37*$B$17","v":1.8703328927536347},9.1879107081533107,0.12757613714285471,115.85336078127351,40.857923321912452]
[null,{"$f":"SUM(B14:B17)","v":90.3},"Summe Winter (kWh)>",{"$f":"SUM(D14:D17)","v":235.81415681671598},{"$f":"SUM(E14:E17)","v":197.86917152314905},225.14024887102056,190.69840792627082,365.97862362632134,209.68886071003556]
["Anzahl der Tage Gesamt >",{"$f":"B8+B13+B18","v":365.3},"Jahresertrag (kWh) >",{"$f":"D8+D13+D18","v":7541.0496428730348},{"$f":"E8+E13+E18","v":6905.385963441835},7409.9178444934878,6827.44598046789,7454.3388093870735,5882.7188804347525]
[null,{"$f":"MAX(D19:I19)","v":7541.0496428730348},"Leistung Jahresertrag (%) >",{"$f":"D19/($B$20/100)","v":99.999999999999986},91.57062067570449,98.261093553422256,90.537077778296222,98.850149016484579,78.009284635786031]
["Hinweis / die Erträge sind nur theoretisch nach der Einstrahlung möglich, wenn sie auch nutzbar sind (z.B. im Sommer ist nur ein Teil nutzbar, je nach Verbrauch und Anlagengröße)"]
[null,null,null,{"$f":"\"Tagesertrag bei eingetragener Fläche \"&C22&\" m² im Tagesverlauf von Azimut -70° bis +70°\"","v":"Tagesertrag bei eingetragener Fläche  m² im Tagesverlauf von Azimut -70° bis +70°"}]
[{"$f":"\"Sommer Diff. \"&Eingaben!$B$5","v":"Sommer Diff. 35"},"Strahlung (%)","Strahlung/kWh/m²",{"$f":"Eingaben!$D$3","v":"SolRose 26"},{"$f":"Eingaben!$E$3","v":"Synergie 210"},{"$f":"Eingaben!$F$3","v":"Sunex AMX 2,85"},{"$f":"Eingaben!$G$3","v":"Sunex 2,0"},{"$f":"Eingaben!$H$3","v":"Star Azzurro CPC"},{"$f":"Eingaben!$I$3","v":"Billig VRK"}]
["Sommer sonniger Tag",100,{"$f":"Eingaben!Q40","v":5.2411666666666665},{"$f":"Sommer!D44","v":32.357466491078007},{"$f":"Sommer!E44","v":30.156920772551125},{"$f":"Sommer!F44","v":32.066570191769614},{"$f":"Sommer!G44","v":29.956548435630882},{"$f":"Sommer!H44","v":30.046081100510619},{"$f":"Sommer!I44","v":24.89059922262711}]
["Sommer leicht bewölkt",{"$f":"Eingaben!$L$43","v":75},{"$f":"Eingaben!Q76","v":3.9308749999999999},{"$f":"Sommer!D73","v":22.428324173827999},{"$f":"Sommer!E73","v":20.65927560445218},{"$f":"Sommer!F73","v":22.10519460823819},{"$f":"Sommer!G73","v":20.474999664194421},{"$f":"Sommer!H73","v":22.079336607197966},{"$f":"Sommer!I73","v":17.785030388787881}]
["Sommer mittel bewölkt",{"$f":"Eingaben!$L$79","v":50},{"$f":"Eingaben!Q118","v":2.6205833333333333},{"$f":"Sommer!D102","v":12.499181856578003},{"$f":"Sommer!E102","v":11.16163043635324},{"$f":"Sommer!F102","v":12.14381902470676},{"$f":"Sommer!G102","v":10.993450892757968},{"$f":"Sommer!H102","v":14.112592113885306},{"$f":"Sommer!I102","v":10.679461554948647}]
["Sommer stark bewölkt",{"$f":"Eingaben!$L$121","v":25},{"$f":"Eingaben!Q154","v":1.3102916666666666},{"$f":"Sommer!D131","v":2.5619933914360007},{"$f":"Sommer!E131","v":1.7427120590562324},{"$f":"Sommer!F131","v":2.2156788944347037},{"$f":"Sommer!G131","v":1.6079585334752056},{"$f":"Sommer!H131","v":5.6874843921971445},{"$f":"Sommer!I131","v":3.3365234007327982}]
[{"$f":"\"Frühjahr/Herbst Diff. \"&Eingaben!$B$4","v":"Frühjahr/Herbst Diff. 32"}]
["Frühjahr/Herbst sonniger Tag",100,{"$f":"Eingaben!Q29","v":6.1041333333333334},{"$f":"Herbstfrühjahr!D44","v":37.360832804684811},{"$f":"Herbstfrühjahr!E44","v":34.48806072219827},{"$f":"Herbstfrühjahr!F44","v":36.806387060976725},{"$f":"Herbstfrühjahr!G44","v":34.149424649416112},{"$f":"Herbstfrühjahr!H44","v":34.54385126638477},{"$f":"Herbstfrühjahr!I44","v":28.162164808258254}]
["Frühjahr/Herbst leicht bewölkt",{"$f":"B25","v":75},{"$f":"Eingaben!Q65","v":4.5780999999999992},{"$f":"Herbstfrühjahr!D73","v":25.623889142444799},{"$f":"Herbstfrühjahr!E73","v":23.308858942766378},{"$f":"Herbstfrühjahr!F73","v":25.08636713780529},{"$f":"Herbstfrühjahr!G73","v":22.995005083911987},{"$f":"Herbstfrühjahr!H73","v":25.318005125900413},{"$f":"Herbstfrühjahr!I73","v":19.969877501424563}]
["Frühjahr/Herbst mittel bewölkt",{"$f":"B26","v":50},{"$f":"Eingaben!Q108","v":3.0520666666666667},{"$f":"Herbstfrühjahr!D102","v":13.886945480204806},{"$f":"Herbstfrühjahr!E102","v":12.152985497989569},{"$f":"Herbstfrühjahr!F102","v":13.366347214633867},{"$f":"Herbstfrühjahr!G102","v":11.892946041719808},{"$f":"Herbstfrühjahr!H102","v":16.092158985416059},{"$f":"Herbstfrühjahr!I102","v":11.777590194590879}]
["Frühjahr/Herbst stark bewölkt",{"$f":"B27","v":25},{"$f":"Eingaben!Q143","v":1.5260333333333334},{"$f":"Herbstfrühjahr!D131","v":2.7600906583264013},{"$f":"Herbstfrühjahr!E131","v":1.8479992602372957},{"$f":"Herbstfrühjahr!F131","v":2.4090658566983976},{"$f":"Herbstfrühjahr!G131","v":1.6823302384909045},{"$f":"Herbstfrühjahr!H131","v":6.8663128449317012},{"$f":"Herbstfrühjahr!I131","v":3.6869582112989363}]
[{"$f":"\"Winter Diff. \"&Eingaben!$B$3","v":"Winter Diff. 28"}]
["Winter sonniger Tag",100,{"$f":"Eingaben!Q18","v":2.1251500000000001},{"$f":"Winter!D44","v":11.612162716155003},{"$f":"Winter!E44","v":10.441334654515945},{"$f":"Winter!F44","v":11.308425172565853},{"$f":"Winter!G44","v":10.23757694411035},{"$f":"Winter!H44","v":11.446628149832655},{"$f":"Winter!I44","v":8.2072998056269881}]
["Winter leicht bewölkt",{"$f":"B25","v":75},{"$f":"Eingaben!Q54","v":1.5938625000000002},{"$f":"Winter!D73","v":7.5468704443762524},{"$f":"Winter!E73","v":6.6073554818782627},{"$f":"Winter!F73","v":7.2915121665658544},{"$f":"Winter!G73","v":6.4193566516965532},{"$f":"Winter!H73","v":8.2657551074244928},{"$f":"Winter!I73","v":5.6323560094018683}]
["Winter mittel bewölkt",{"$f":"B26","v":50},{"$f":"Eingaben!Q90","v":1.062575},{"$f":"Winter!D102","v":3.5522459828055011},{"$f":"Winter!E102","v":2.9513730074434799},{"$f":"Winter!F102","v":3.3804969590069684},{"$f":"Winter!G102","v":2.8135400089221689},{"$f":"Winter!H102","v":5.0848820650163278},{"$f":"Winter!I102","v":3.0913410723445938}]
["Winter stark bewölkt",{"$f":"B27","v":25},{"$f":"Eingaben!Q132","v":0.53128750000000002},{"$f":"Winter!D131","v":0.21455871030000034},{"$f":"Winter!E131","v":3.2247118840579909E-2},{"$f":"Winter!F131","v":0.15841225358885019},{"$f":"Winter!G131","v":2.1995885714285292E-3},{"$f":"Winter!H131","v":1.9974717376081639},{"$f":"Winter!I131","v":0.7044469538260768}]

{"sheet":"Amortisation","index":7,"n_rows":29,"n_cols":11,"rows_kept":29,"cut":false,"hidden":false,"merged":[[16,2,16,3],[17,2,17,3],[18,2,18,3],[19,2,19,3],[20,2,20,3],[14,2,14,3],[5,0,5,1],[13,1,13,4],[0,0,1,10],[13,6,13,9],[2,6,2,9],[13,10,20,10],[2,2,2,4],[3,2,3,3],[4,2,4,3],[5,2,5,3],[2,0,2,1],[3,0,3,1],[4,0,4,1],[2,10,4,10],[15,2,15,3],[27,2,27,3],[28,2,28,3],[21,6,21,10],[21,5,22,5],[22,2,22,3],[23,2,23,3],[24,2,24,3],[25,2,25,3],[26,2,26,3],[21,1,21,4]]}
["Angaben zur Amortisationsberechnung "]
[]
["Anlagenkosten (ohne Kollektor)",null,"realer Energieverbrauch (kWh)",null,null,"Gesamtverbrauch","durchschnittliche Kosten der ext.Energie  innerhalb der eingetragenen Laufzeit (€/kWh)",null,null,null,"Medium"]
[8000,null,"Sommer",null,843,{"$f":"E4+E5+E6","v":18910},"Preis aktuell","Preis leichter Anstieg ","Preis mittlerer Anstieg","Preis hoher Anstieg"]
["Berechnungszeitraum 1 (J)",null,"Frühjahr + Herbst",null,7377,"Preis in € >",{"$f":"G6*10","v":0.85000000000000009},{"$f":"H6*10","v":0.95},1.2,1.5]
[15,null,"Winter",null,10690,"Preis pro kWh >",8.5000000000000006E-2,9.5000000000000001E-2,0.12,0.15,"Öl"]
["Kollektorbez.","Jahresertr. (/m² Brutto)","Bruttofläche","Kol.Kosten €/m²","Kollektorkosten gesamt","nutzbare Erträge (kWh)","Gewinn bei. akt.Preis (€)","Gewinn leichter Anstieg (€)","Gewinn mittlerer Anstieg (€)","Gewinn hoher Anstieg (€)","Aufpreis"]
[{"$f":"Eingaben!D3","v":"SolRose 26"},{"$f":"F8/C8","v":553.20023598020646},{"$f":"Eingaben!$B$6","v":10.46},{"$f":"Eingaben!D17","v":0},{"$f":"C8*D8","v":0},{"$f":"B16+C16+E16","v":5786.4744683529598},{"$f":"IF(A8>\"\",(B8*C8*$G$6*$A$6)-(E8+K8+$A$4),\"\")","v":-622.24505284997576},{"$f":"IF(A8>\"\",(B8*C8*$H$6*$A$6)-(E8+K8+$A$4),\"\")","v":245.72611740296816},{"$f":"IF(A8>\"\",(B8*C8*$I$6*$A$6)-(E8+K8+$A$4),\"\")","v":2415.654043035327},{"$f":"IF(A8>\"\",(B8*C8*$J$6*$A$6)-(E8+K8+$A$4),\"\")","v":5019.5675537941588}]
[{"$f":"Eingaben!E3","v":"Synergie 210"},{"$f":"F9/C9","v":510.18912296077116},{"$f":"Eingaben!$B$6","v":10.46},{"$f":"Eingaben!E17","v":104},{"$f":"C9*D9","v":1087.8400000000001},{"$f":"B17+C17+E17","v":5336.5782261696668},{"$f":"IF(A9>\"\",(B9*C9*$G$6*$A$6)-(E9+K9+$A$4),\"\")","v":-2283.7027616336745},{"$f":"IF(A9>\"\",(B9*C9*$H$6*$A$6)-(E9+K9+$A$4),\"\")","v":-1483.2160277082248},{"$f":"IF(A9>\"\",(B9*C9*$I$6*$A$6)-(E9+K9+$A$4),\"\")","v":518.00080710539987},{"$f":"IF(A9>\"\",(B9*C9*$J$6*$A$6)-(E9+K9+$A$4),\"\")","v":2919.4610088817499}]
[{"$f":"Eingaben!F3","v":"Sunex AMX 2,85"},543.330926634712,{"$f":"Eingaben!$B$6","v":10.46},{"$f":"Eingaben!F17","v":0},0,5683.2414925990879,-753.86709693616285,98.619126953701198,2229.8346866783577,4787.2933583479462]
[{"$f":"Eingaben!G3","v":"Sunex 2,0"},504.43764414060882,{"$f":"Eingaben!$B$6","v":10.46},{"$f":"Eingaben!G17","v":135},1412.1000000000001,5276.4177577107685,-2684.6673589187703,-1893.2046952621549,85.451963879380855,2459.8399548492289]
[{"$f":"Eingaben!H3","v":"Star Azzurro CPC"},558.17239227628136,{"$f":"Eingaben!$B$6","v":10.46},{"$f":"Eingaben!H17","v":650},6799.0000000000009,5838.4832232099034,-7354.9338904073729,-6479.1614069258867,-4289.7301982221743,-1662.4127477777183]
[{"$f":"Eingaben!I3","v":"Billig VRK"},450.07289013791427,{"$f":"Eingaben!$B$6","v":10.46},{"$f":"Eingaben!I17","v":218},2280.2800000000002,4707.7624308425839,-4277.8829006757051,-3571.7185360493186,-1806.3076244833501,312.18546939581211]
[null,"max. nutzbare Teilerträge",null,null,null,"Zeitraum 2 (J)","Gewinne nach verschiedenen Preisentwicklungen !"]
["Kollektorbez.","Sommer","Frühjahr/Herbst",null,"Winter",20,"Gewinn bei. akt.Preis (€)","Gewinn leichter Anstieg (€)","Gewinn mittlerer Anstieg (€)","Gewinn hoher Anstieg (€)"]
[{"$f":"A8","v":"SolRose 26"},{"$f":"IF($E$4>Eingaben!D91,Eingaben!D91,$E$4)","v":843},{"$f":"IF($E$5>Eingaben!D92,Eingaben!D92,$E$5)","v":4707.6603115362441},null,{"$f":"IF($E$6>Eingaben!D93,Eingaben!D93,$E$6)","v":235.81415681671598},{"$f":"IF(A8>\"\",A8,\"\")","v":"SolRose 26"},{"$f":"IF(A8>\"\",(B8*C8*$G$6*$F$15)-(E8+K8+$A$4),\"\")","v":1837.0065962000317},{"$f":"IF(A8>\"\",(B8*C8*$H$6*$F$15)-(E8+K8+$A$4),\"\")","v":2994.3014898706242},{"$f":"IF(A8>\"\",(B8*C8*$I$6*$F$15)-(E8+K8+$A$4),\"\")","v":5887.5387240471027},{"$f":"IF(A8>\"\",(B8*C8*$J$6*$F$15)-(E8+K8+$A$4),\"\")","v":9359.4234050588784}]
[{"$f":"A9","v":"Synergie 210"},{"$f":"IF($E$4>Eingaben!E91,Eingaben!E91,$E$4)","v":843},{"$f":"IF($E$5>Eingaben!E92,Eingaben!E92,$E$5)","v":4295.7090546465179},null,{"$f":"IF($E$6>Eingaben!E93,Eingaben!E93,$E$6)","v":197.86917152314905},"Synergie 210",-15.657015511565987,1051.6586297223676,3719.9477428071987,6921.8946785090011]
["Sunex AMX 2,85",{"$f":"IF($E$4>Eingaben!F91,Eingaben!F91,$E$4)","v":843},{"$f":"IF($E$5>Eingaben!F92,Eingaben!F92,$E$5)","v":4615.1012437280669},null,{"$f":"IF($E$6>Eingaben!F93,Eingaben!F93,$E$6)","v":225.14024887102056},"Sunex AMX 2,85",1661.5105374184495,2798.1588359382677,5639.7795822378102,9049.7244777972628]
["Sunex 2,0",{"$f":"IF($E$4>Eingaben!G91,Eingaben!G91,$E$4)","v":843},{"$f":"IF($E$5>Eingaben!G92,Eingaben!G92,$E$5)","v":4242.7193497844974},null,{"$f":"IF($E$6>Eingaben!G93,Eingaben!G93,$E$6)","v":190.69840792627082},"Sunex 2,0",-442.18981189169244,613.09373965045961,3251.3026185058425,6417.1532731323059]
["Star Azzurro CPC",{"$f":"IF($E$4>Eingaben!H91,Eingaben!H91,$E$4)","v":843},{"$f":"IF($E$5>Eingaben!H92,Eingaben!H92,$E$5)","v":4629.5045995835817},null,{"$f":"IF($E$6>Eingaben!H93,Eingaben!H93,$E$6)","v":365.97862362632134},"Star Azzurro CPC",-4873.5785205431639,-3705.8818759011829,-786.640264296233,2716.4496696297101]
["Billig VRK",{"$f":"IF($E$4>Eingaben!I91,Eingaben!I91,$E$4)","v":843},{"$f":"IF($E$5>Eingaben!I92,Eingaben!I92,$E$5)","v":3655.073570132548},null,{"$f":"IF($E$6>Eingaben!I93,Eingaben!I93,$E$6)","v":209.68886071003556},"Billig VRK",-2277.0838675676068,-1335.5313813990906,1018.3498340222013,3843.0072925277491]
[null,"Deckung (%)",null,null,null,{"$f":"A15","v":"Kollektorbez."},"Amortisation nach Jahre "]
["Kollektorbez.","Sommer","Frühjahr/Herbst",null,"Winter",null,"Jahre bei aktuellen Preis ","Jahre leichter Anstieg ","Jahre mittlerer Anstieg ","Jahre hoher Anstieg ","Preis (€)"]
[{"$f":"A16","v":"SolRose 26"},{"$f":"B16/($E$4/100)","v":100},{"$f":"C16/($E$5/100)","v":63.815376325555704},null,{"$f":"E16/($E$6/100)","v":2.2059322433743307},{"$f":"A16","v":"SolRose 26"},{"$f":"($A$4+E8) /(F8*$G$6)","v":16.265110573556687},{"$f":"($A$4+E8) /(F8*$H$6)","v":14.552993671077033},{"$f":"($A$4+E8) /(F8*$I$6)","v":11.521119989602653},{"$f":"($A$4+E8) /(F8*$J$6)","v":9.2168959916821223},{"$f":"$A$4+E8+K8","v":8000}]
[{"$f":"A17","v":"Synergie 210"},{"$f":"B17/($E$4/100)","v":100},{"$f":"C17/($E$5/100)","v":58.231110948170233},null,{"$f":"E17/($E$6/100)","v":1.8509744763624794},"Synergie 210",{"$f":"($A$4+E9) /(F9*$G$6)","v":20.034516533756729},{"$f":"($A$4+E9) /(F9*$H$6)","v":17.925620056519179},{"$f":"($A$4+E9) /(F9*$I$6)","v":14.191115878077685},{"$f":"($A$4+E9) /(F9*$J$6)","v":11.352892702462148},{"$f":"$A$4+E9+K9","v":9087.84}]
["Sunex AMX 2,85",100,62.560678375058522,null,2.1060827770909314,"Sunex AMX 2,85",16.560557418048617,14.81734084772771,11.730394837784438,9.3843158702275513,8000]
["Sunex 2,0",100,57.512801271309442,null,1.7838953033327485,"Sunex 2,0",20.985940332998915,18.776893982156924,14.865041069207567,11.892032855366052,9412.1]
["Star Azzurro CPC",100,62.755925167189673,null,3.4235605577766259,"Star Azzurro CPC",29.820396102332307,26.681407038928906,21.122780572485386,16.898224457988309,14799]
["Billig VRK",100,49.546883152128892,null,1.9615421956037002,"Billig VRK",25.690436245439201,22.986179798550868,18.197392340519439,14.557913872415552,10280.280000000001]

{"sheet":"Temperaturen","index":8,"n_rows":238,"n_cols":23,"rows_kept":238,"cut":false,"hidden":false,"merged":[[208,0,210,1],[211,0,213,1],[202,0,204,1],[205,0,207,1],[198,2,199,8],[200,2,201,8],[9,0,9,1],[196,0,201,1],[20,1,22,1],[23,0,25,0],[23,1,25,1],[26,0,28,0],[26,1,28,1],[29,0,31,0],[29,1,31,1],[32,0,34,0],[32,1,34,1],[35,0,37,0],[35,1,37,1],[38,0,40,0],[38,1,40,1],[57,0,59,0],[57,1,59,1],[78,0,80,0],[0,2,0,8],[0,0,0,1],[11,1,13,1],[11,0,13,0],[14,0,16,0],[14,1,16,1],[17,0,19,0],[17,1,19,1],[20,0,22,0],[229,0,231,1],[232,0,234,1],[235,0,237,1],[214,0,216,1],[217,0,219,1],[220,0,222,1],[223,0,225,1],[226,0,228,1],[41,0,43,0],[41,1,43,1],[44,0,46,0],[44,1,46,1],[47,0,49,0],[47,1,49,1],[60,0,62,0],[60,1,62,1],[63,0,65,0],[63,1,65,1],[66,0,68,0],[66,1,68,1],[50,0,52,0],[50,1,52,1],[53,0,55,0],[53,1,55,1],[78,1,80,1],[81,0,83,0],[81,1,83,1],[84,0,86,0],[84,1,86,1],[69,0,71,0],[69,1,71,1],[72,0,74,0],[72,1,74,1],[75,0,77,0],[75,1,77,1],[96,0,98,0],[96,1,98,1],[99,0,101,0],[99,1,101,1],[103,0,105,0],[103,1,105,1],[87,0,89,0],[87,1,89,1],[90,0,92,0],[90,1,92,1],[93,0,95,0],[93,1,95,1],[115,1,117,1],[118,0,120,0],[118,1,120,1],[121,0,123,0],[121,1,123,1],[106,0,108,0],[106,1,108,1],[109,0,111,0],[109,1,111,1],[112,0,114,0],[112,1,114,1],[167,0,169,0],[167,1,169,1],[152,0,154,0],[152,1,154,1],[155,0,157,0],[155,1,157,1],[158,0,160,0],[158,1,160,1],[142,0,144,0],[142,1,144,1],[145,0,147,0],[145,1,147,1],[149,0,151,0],[149,1,151,1],[188,0,190,0],[188,1,190,1],[191,0,193,0],[191,1,193,1],[10,0,10,2],[10,10,10,15],[102,0,102,2],[102,3,102,8],[179,0,181,0],[179,1,181,1],[182,0,184,0],[182,1,184,1],[185,0,187,0],[185,1,187,1],[170,0,172,0],[170,1,172,1],[173,0,175,0],[173,1,175,1],[176,0,178,0],[176,1,178,1],[161,0,163,0],[161,1,163,1],[164,0,166,0],[164,1,166,1],[102,17,102,22],[148,0,148,2],[148,3,148,8],[148,10,148,15],[148,17,148,22],[10,17,10,22],[10,3,10,8],[56,0,56,2],[56,3,56,8],[56,10,56,15],[56,17,56,22],[133,0,135,0],[133,1,135,1],[136,0,138,0],[136,1,138,1],[139,0,141,0],[139,1,141,1],[124,0,126,0],[124,1,126,1],[127,0,129,0],[127,1,129,1],[130,0,132,0],[130,1,132,1],[115,0,117,0],[196,2,197,2],[196,3,197,3],[196,4,197,4],[196,5,197,5],[196,6,197,6],[196,7,197,7],[196,8,197,8],[1,2,8,8],[102,10,102,15]]}
["Vorgaben",null,"Berechnung der Differenzen und Kollektortemperaturen bei verschiedenen Vorgaben !"]
[{"$f":"Eingaben!A5","v":"Diff.Sommer > "},{"$f":"Eingaben!B5","v":35},"Formel   Diff = Q / (c*m)    Q = kW   C=3,7 kJ/kg K (Glycolgemisch, Wasser =~4,19)  m= Liter (je nach Durchfluss)"]
[{"$f":"Eingaben!A4","v":"Diff.Frühjahr/Herbst > "},{"$f":"Eingaben!B4","v":32}]
[{"$f":"Eingaben!A3","v":"Diff.Winter > "},{"$f":"Eingaben!B3","v":28}]
[{"$f":"Eingaben!A6","v":" Gesamtfläche (m²) > "},{"$f":"Eingaben!B6","v":10.46}]
["AT Sommer > ",25]
["AT Frühj./Herbst > ",15]
["AT Winter > ",5]
["Durchfluss (l/h) > ",600]
[null,null,{"$f":"C197","v":"Kollektor > "},"SolRose 26","Synergie 210","Sunex AMX 2,85","Sunex 2,0","Star Azzurro CPC","Billig VRK",null,{"$f":"D197","v":"SolRose 26"},"Synergie 210","Sunex AMX 2,85","Sunex 2,0","Star Azzurro CPC","Billig VRK",null,{"$f":"D197","v":"SolRose 26"},"Synergie 210","Sunex AMX 2,85","Sunex 2,0","Star Azzurro CPC","Billig VRK"]
["Detailtemperaturen bei allen Winkelfaktoren",null,null,"Detailtemperaturen Sommer bei Sonne",null,null,null,null,null,null,"Detailtemperaturen Frühjahr Herbst bei Sonne",null,null,null,null,null,null,"Detailtemperaturen Winter bei Sonne"]
["Sonne  Azimut > ",-70,"Diff. Solarkreis (K) > ",{"$f":"Sommer!D28/(3.7*($B$9/3600))","v":4.82596541768919},{"$f":"Sommer!E28/(3.7*($B$9/3600))","v":4.8248137701527618},{"$f":"Sommer!F28/(3.7*($B$9/3600))","v":5.22185566708918},{"$f":"Sommer!G28/(3.7*($B$9/3600))","v":4.8306747172946372},{"$f":"Sommer!H28/(3.7*($B$9/3600))","v":6.8190990255819095},{"$f":"Sommer!I28/(3.7*($B$9/3600))","v":4.712107342736843},null,{"$f":"Herbstfrühjahr!D28/(3.7*(Temperaturen!$B$9/3600))","v":1.6906344707286487},{"$f":"Herbstfrühjahr!E28/(3.7*(Temperaturen!$B$9/3600))","v":1.5869960182373684},{"$f":"Herbstfrühjahr!F28/(3.7*(Temperaturen!$B$9/3600))","v":1.791102820854694},{"$f":"Herbstfrühjahr!G28/(3.7*(Temperaturen!$B$9/3600))","v":1.5589667022681402},{"$f":"Herbstfrühjahr!H28/(3.7*(Temperaturen!$B$9/3600))","v":3.0953143104423604},{"$f":"Herbstfrühjahr!I28/(3.7*(Temperaturen!$B$9/3600))","v":1.9126123092516749},null,{"$f":"Winter!D28/(3.7*(Temperaturen!$B$9/3600))","v":0},{"$f":"Winter!E28/(3.7*(Temperaturen!$B$9/3600))","v":0},{"$f":"Winter!F28/(3.7*(Temperaturen!$B$9/3600))","v":0},{"$f":"Winter!G28/(3.7*(Temperaturen!$B$9/3600))","v":0},{"$f":"Winter!H28/(3.7*(Temperaturen!$B$9/3600))","v":0},{"$f":"Winter!I28/(3.7*(Temperaturen!$B$9/3600))","v":0}]
[null,null,"Solar VL Temperatur (°C) > ",{"$f":"$B$2+$B$6+(D12/2)","v":62.412982708844595},62.412406885076379,62.610927833544594,62.415337358647321,63.409549512790953,62.356053671368421,null,{"$f":"Temperaturen!$B$2+Temperaturen!$B$6+(K12/2)","v":60.845317235364327},{"$f":"Temperaturen!$B$2+Temperaturen!$B$6+(L12/2)","v":60.793498009118686},{"$f":"Temperaturen!$B$2+Temperaturen!$B$6+(M12/2)","v":60.895551410427345},{"$f":"Temperaturen!$B$2+Temperaturen!$B$6+(N12/2)","v":60.779483351134068},{"$f":"Temperaturen!$B$2+Temperaturen!$B$6+(O12/2)","v":61.547657155221181},{"$f":"Temperaturen!$B$2+Temperaturen!$B$6+(P12/2)","v":60.956306154625835},null,{"$f":"Temperaturen!$B$2+Temperaturen!$B$6+(R12/2)","v":60},{"$f":"Temperaturen!$B$2+Temperaturen!$B$6+(S12/2)","v":60},{"$f":"Temperaturen!$B$2+Temperaturen!$B$6+(T12/2)","v":60},{"$f":"Temperaturen!$B$2+Temperaturen!$B$6+(U12/2)","v":60},{"$f":"Temperaturen!$B$2+Temperaturen!$B$6+(V12/2)","v":60},{"$f":"Temperaturen!$B$2+Temperaturen!$B$6+(W12/2)","v":60}]
[null,null,"Solar RL Temperatur (°C) > ",{"$f":"$B$2+$B$6-(D12/2)","v":57.587017291155405},57.587593114923621,57.389072166455406,57.584662641352679,56.590450487209047,57.643946328631579,null,{"$f":"Temperaturen!$B$2+Temperaturen!$B$6-(K12/2)","v":59.154682764635673},{"$f":"Temperaturen!$B$2+Temperaturen!$B$6-(L12/2)","v":59.206501990881314},{"$f":"Temperaturen!$B$2+Temperaturen!$B$6-(M12/2)","v":59.104448589572655},{"$f":"Temperaturen!$B$2+Temperaturen!$B$6-(N12/2)","v":59.220516648865932},{"$f":"Temperaturen!$B$2+Temperaturen!$B$6-(O12/2)","v":58.452342844778819},{"$f":"Temperaturen!$B$2+Temperaturen!$B$6-(P12/2)","v":59.043693845374165},null,{"$f":"Temperaturen!$B$2+Temperaturen!$B$6-(R12/2)","v":60},{"$f":"Temperaturen!$B$2+Temperaturen!$B$6-(S12/2)","v":60},{"$f":"Temperaturen!$B$2+Temperaturen!$B$6-(T12/2)","v":60},{"$f":"Temperaturen!$B$2+Temperaturen!$B$6-(U12/2)","v":60},{"$f":"Temperaturen!$B$2+Temperaturen!$B$6-(V12/2)","v":60},{"$f":"Temperaturen!$B$2+Temperaturen!$B$6-(W12/2)","v":60}]
["Sonne  Azimut > ",-60,"Diff. Solarkreis (K) > ",{"$f":"Sommer!D29/(3.7*($B$9/3600))","v":6.953814572837838},{"$f":"Sommer!E29/(3.7*($B$9/3600))","v":6.6839532747356074},{"$f":"Sommer!F29/(3.7*($B$9/3600))","v":7.1180300098502682},{"$f":"Sommer!G29/(3.7*($B$9/3600))","v":6.6182914189854891},{"$f":"Sommer!H29/(3.7*($B$9/3600))","v":7.4209262577220061},{"$f":"Sommer!I29/(3.7*($B$9/3600))","v":6.8297490605912321},null,{"$f":"Herbstfrühjahr!D29/(3.7*(Temperaturen!$B$9/3600))","v":4.1918161733708121},{"$f":"Herbstfrühjahr!E29/(3.7*(Temperaturen!$B$9/3600))","v":3.9639847287426568},{"$f":"Herbstfrühjahr!F29/(3.7*(Temperaturen!$B$9/3600))","v":4.2726784832319424},{"$f":"Herbstfrühjahr!G29/(3.7*(Temperaturen!$B$9/3600))","v":3.9018446320117173},{"$f":"Herbstfrühjahr!H29/(3.7*(Temperaturen!$B$9/3600))","v":4.8285998020077221},{"$f":"Herbstfrühjahr!I29/(3.7*(Temperaturen!$B$9/3600))","v":4.288448449276193},null,{"$f":"Winter!D29/(3.7*(Temperaturen!$B$9/3600))","v":0},{"$f":"Winter!E29/(3.7*(Temperaturen!$B$9/3600))","v":0},{"$f":"Winter!F29/(3.7*(Temperaturen!$B$9/3600))","v":0},{"$f":"Winter!G29/(3.7*(Temperaturen!$B$9/3600))","v":0},{"$f":"Winter!H29/(3.7*(Temperaturen!$B$9/3600))","v":0},{"$f":"Winter!I29/(3.7*(Temperaturen!$B$9/3600))","v":0}]
[null,null,"Solar VL Temperatur (°C) > ",{"$f":"$B$2+$B$6+(D15/2)","v":63.476907286418921},63.341976637367807,63.559015004925136,63.309145709492746,63.710463128861001,63.414874530295613,null,{"$f":"Temperaturen!$B$2+Temperaturen!$B$6+(K15/2)","v":62.095908086685405},{"$f":"Temperaturen!$B$2+Temperaturen!$B$6+(L15/2)","v":61.98199236437133},{"$f":"Temperaturen!$B$2+Temperaturen!$B$6+(M15/2)","v":62.136339241615971},{"$f":"Temperaturen!$B$2+Temperaturen!$B$6+(N15/2)","v":61.950922316005858},{"$f":"Temperaturen!$B$2+Temperaturen!$B$6+(O15/2)","v":62.414299901003858},{"$f":"Temperaturen!$B$2+Temperaturen!$B$6+(P15/2)","v":62.144224224638094},null,{"$f":"Temperaturen!$B$2+Temperaturen!$B$6+(R15/2)","v":60},{"$f":"Temperaturen!$B$2+Temperaturen!$B$6+(S15/2)","v":60},{"$f":"Temperaturen!$B$2+Temperaturen!$B$6+(T15/2)","v":60},{"$f":"Temperaturen!$B$2+Temperaturen!$B$6+(U15/2)","v":60},{"$f":"Temperaturen!$B$2+Temperaturen!$B$6+(V15/2)","v":60},{"$f":"Temperaturen!$B$2+Temperaturen!$B$6+(W15/2)","v":60}]
[null,null,"Solar RL Temperatur (°C) > ",{"$f":"$B$2+$B$6-(D15/2)","v":56.523092713581079},56.658023362632193,56.440984995074864,56.690854290507254,56.289536871138999,56.585125469704387,null,{"$f":"Temperaturen!$B$2+Temperaturen!$B$6-(K15/2)","v":57.904091913314595},{"$f":"Temperaturen!$B$2+Temperaturen!$B$6-(L15/2)","v":58.01800763562867},{"$f":"Temperaturen!$B$2+Temperaturen!$B$6-(M15/2)","v":57.863660758384029},{"$f":"Temperaturen!$B$2+Temperaturen!$B$6-(N15/2)","v":58.049077683994142},{"$f":"Temperaturen!$B$2+Temperaturen!$B$6-(O15/2)","v":57.585700098996142},{"$f":"Temperaturen!$B$2+Temperaturen!$B$6-(P15/2)","v":57.855775775361906},null,{"$f":"Temperaturen!$B$2+Temperaturen!$B$6-(R15/2)","v":60},{"$f":"Temperaturen!$B$2+Temperaturen!$B$6-(S15/2)","v":60},{"$f":"Temperaturen!$B$2+Temperaturen!$B$6-(T15/2)","v":60},{"$f":"Temperaturen!$B$2+Temperaturen!$B$6-(U15/2)","v":60},{"$f":"Temperaturen!$B$2+Temperaturen!$B$6-(V15/2)","v":60},{"$f":"Temperaturen!$B$2+Temperaturen!$B$6-(W15/2)","v":60}]
["Sonne  Azimut > ",-50,"Diff. Solarkreis (K) > ",{"$f":"Sommer!D30/(3.7*($B$9/3600))","v":8.5699510645135142},{"$f":"Sommer!E30/(3.7*($B$9/3600))","v":7.8981601045358403},{"$f":"Sommer!F30/(3.7*($B$9/3600))","v":8.395289508597795},{"$f":"Sommer!G30/(3.7*($B$9/3600))","v":7.909063496205567},{"$f":"Sommer!H30/(3.7*($B$9/3600))","v":7.6701718427027039},{"$f":"Sommer!I30/(3.7*($B$9/3600))","v":7.7414655592396233},null,{"$f":"Herbstfrühjahr!D30/(3.7*(Temperaturen!$B$9/3600))","v":6.2135615822400005},{"$f":"Herbstfrühjahr!E30/(3.7*(Temperaturen!$B$9/3600))","v":5.684211421405406},{"$f":"Herbstfrühjahr!F30/(3.7*(Temperaturen!$B$9/3600))","v":6.0802974193035118},{"$f":"Herbstfrühjahr!G30/(3.7*(Temperaturen!$B$9/3600))","v":5.6726753774890168},{"$f":"Herbstfrühjahr!H30/(3.7*(Temperaturen!$B$9/3600))","v":5.7592063420540534},{"$f":"Herbstfrühjahr!I30/(3.7*(Temperaturen!$B$9/3600))","v":5.7157555571337406},null,{"$f":"Winter!D30/(3.7*(Temperaturen!$B$9/3600))","v":0},{"$f":"Winter!E30/(3.7*(Temperaturen!$B$9/3600))","v":0},{"$f":"Winter!F30/(3.7*(Temperaturen!$B$9/3600))","v":0},{"$f":"Winter!G30/(3.7*(Temperaturen!$B$9/3600))","v":0},{"$f":"Winter!H30/(3.7*(Temperaturen!$B$9/3600))","v":0.49258848291891899},{"$f":"Winter!I30/(3.7*(Temperaturen!$B$9/3600))","v":5.5019771623535448E-2}]
[null,null,"Solar VL Temperatur (°C) > ",{"$f":"$B$2+$B$6+(D18/2)","v":64.284975532256752},63.949080052267917,64.197644754298892,63.954531748102781,63.83508592135135,63.870732779619814,null,{"$f":"Temperaturen!$B$2+Temperaturen!$B$6+(K18/2)","v":63.106780791120002},{"$f":"Temperaturen!$B$2+Temperaturen!$B$6+(L18/2)","v":62.842105710702704},{"$f":"Temperaturen!$B$2+Temperaturen!$B$6+(M18/2)","v":63.040148709651753},{"$f":"Temperaturen!$B$2+Temperaturen!$B$6+(N18/2)","v":62.836337688744507},{"$f":"Temperaturen!$B$2+Temperaturen!$B$6+(O18/2)","v":62.879603171027028},{"$f":"Temperaturen!$B$2+Temperaturen!$B$6+(P18/2)","v":62.857877778566873},null,{"$f":"Temperaturen!$B$2+Temperaturen!$B$6+(R18/2)","v":60},{"$f":"Temperaturen!$B$2+Temperaturen!$B$6+(S18/2)","v":60},{"$f":"Temperaturen!$B$2+Temperaturen!$B$6+(T18/2)","v":60},{"$f":"Temperaturen!$B$2+Temperaturen!$B$6+(U18/2)","v":60},{"$f":"Temperaturen!$B$2+Temperaturen!$B$6+(V18/2)","v":60.246294241459459},{"$f":"Temperaturen!$B$2+Temperaturen!$B$6+(W18/2)","v":60.027509885811767}]
[null,null,"Solar RL Temperatur (°C) > ",{"$f":"$B$2+$B$6-(D18/2)","v":55.715024467743241},56.050919947732083,55.802355245701101,56.045468251897219,56.16491407864865,56.129267220380186,null,{"$f":"Temperaturen!$B$2+Temperaturen!$B$6-(K18/2)","v":56.893219208879998},{"$f":"Temperaturen!$B$2+Temperaturen!$B$6-(L18/2)","v":57.157894289297296},{"$f":"Temperaturen!$B$2+Temperaturen!$B$6-(M18/2)","v":56.959851290348247},{"$f":"Temperaturen!$B$2+Temperaturen!$B$6-(N18/2)","v":57.163662311255493},{"$f":"Temperaturen!$B$2+Temperaturen!$B$6-(O18/2)","v":57.120396828972972},{"$f":"Temperaturen!$B$2+Temperaturen!$B$6-(P18/2)","v":57.142122221433127},null,{"$f":"Temperaturen!$B$2+Temperaturen!$B$6-(R18/2)","v":60},{"$f":"Temperaturen!$B$2+Temperaturen!$B$6-(S18/2)","v":60},{"$f":"Temperaturen!$B$2+Temperaturen!$B$6-(T18/2)","v":60},{"$f":"Temperaturen!$B$2+Temperaturen!$B$6-(U18/2)","v":60},{"$f":"Temperaturen!$B$2+Temperaturen!$B$6-(V18/2)","v":59.753705758540541},{"$f":"Temperaturen!$B$2+Temperaturen!$B$6-(W18/2)","v":59.972490114188233}]
["Sonne  Azimut > ",-40,"Diff. Solarkreis (K) > ",{"$f":"Sommer!D31/(3.7*($B$9/3600))","v":9.441456312648647},{"$f":"Sommer!E31/(3.7*($B$9/3600))","v":8.8091239874030549},{"$f":"Sommer!F31/(3.7*($B$9/3600))","v":9.3535576253225337},{"$f":"Sommer!G31/(3.7*($B$9/3600))","v":8.7317567706031145},{"$f":"Sommer!H31/(3.7*($B$9/3600))","v":8.5223377500165469},{"$f":"Sommer!I31/(3.7*($B$9/3600))","v":7.9388289188154673},null,{"$f":"Herbstfrühjahr!D31/(3.7*(Temperaturen!$B$9/3600))","v":7.4359001137816207},{"$f":"Herbstfrühjahr!E31/(3.7*(Temperaturen!$B$9/3600))","v":6.9078744255323166},{"$f":"Herbstfrühjahr!F31/(3.7*(Temperaturen!$B$9/3600))","v":7.3663313015116314},{"$f":"Herbstfrühjahr!G31/(3.7*(Temperaturen!$B$9/3600))","v":6.8300681346334731},{"$f":"Herbstfrühjahr!H31/(3.7*(Temperaturen!$B$9/3600))","v":6.8470304830093793},{"$f":"Herbstfrühjahr!I31/(3.7*(Temperaturen!$B$9/3600))","v":6.3160294820762983},null,{"$f":"Winter!D31/(3.7*(Temperaturen!$B$9/3600))","v":1.3971828503870276},{"$f":"Winter!E31/(3.7*(Temperaturen!$B$9/3600))","v":1.1567326131891895},{"$f":"Winter!F31/(3.7*(Temperaturen!$B$9/3600))","v":1.3426141693696203},{"$f":"Winter!G31/(3.7*(Temperaturen!$B$9/3600))","v":1.0949965997007061},{"$f":"Winter!H31/(3.7*(Temperaturen!$B$9/3600))","v":1.9839406824158852},{"$f":"Winter!I31/(3.7*(Temperaturen!$B$9/3600))","v":1.523295712138627}]
[null,null,"Solar VL Temperatur (°C) > ",{"$f":"$B$2+$B$6+(D21/2)","v":64.720728156324327},64.40456199370152,64.676778812661269,64.365878385301556,64.261168875008281,63.96941445940773,null,{"$f":"Temperaturen!$B$2+Temperaturen!$B$6+(K21/2)","v":63.717950056890814},{"$f":"Temperaturen!$B$2+Temperaturen!$B$6+(L21/2)","v":63.453937212766157},{"$f":"Temperaturen!$B$2+Temperaturen!$B$6+(M21/2)","v":63.683165650755818},{"$f":"Temperaturen!$B$2+Temperaturen!$B$6+(N21/2)","v":63.415034067316739},{"$f":"Temperaturen!$B$2+Temperaturen!$B$6+(O21/2)","v":63.423515241504688},{"$f":"Temperaturen!$B$2+Temperaturen!$B$6+(P21/2)","v":63.158014741038151},null,{"$f":"Temperaturen!$B$2+Temperaturen!$B$6+(R21/2)","v":60.698591425193513},{"$f":"Temperaturen!$B$2+Temperaturen!$B$6+(S21/2)","v":60.578366306594596},{"$f":"Temperaturen!$B$2+Temperaturen!$B$6+(T21/2)","v":60.671307084684813},{"$f":"Temperaturen!$B$2+Temperaturen!$B$6+(U21/2)","v":60.547498299850353},{"$f":"Temperaturen!$B$2+Temperaturen!$B$6+(V21/2)","v":60.991970341207946},{"$f":"Temperaturen!$B$2+Temperaturen!$B$6+(W21/2)","v":60.761647856069317}]
[null,null,"Solar RL Temperatur (°C) > ",{"$f":"$B$2+$B$6-(D21/2)","v":55.279271843675673},55.595438006298473,55.323221187338731,55.634121614698444,55.738831124991727,56.03058554059227,null,{"$f":"Temperaturen!$B$2+Temperaturen!$B$6-(K21/2)","v":56.282049943109186},{"$f":"Temperaturen!$B$2+Temperaturen!$B$6-(L21/2)","v":56.546062787233843},{"$f":"Temperaturen!$B$2+Temperaturen!$B$6-(M21/2)","v":56.316834349244182},{"$f":"Temperaturen!$B$2+Temperaturen!$B$6-(N21/2)","v":56.584965932683261},{"$f":"Temperaturen!$B$2+Temperaturen!$B$6-(O21/2)","v":56.576484758495312},{"$f":"Temperaturen!$B$2+Temperaturen!$B$6-(P21/2)","v":56.841985258961849},null,{"$f":"Temperaturen!$B$2+Temperaturen!$B$6-(R21/2)","v":59.301408574806487},{"$f":"Temperaturen!$B$2+Temperaturen!$B$6-(S21/2)","v":59.421633693405404},{"$f":"Temperaturen!$B$2+Temperaturen!$B$6-(T21/2)","v":59.328692915315187},{"$f":"Temperaturen!$B$2+Temperaturen!$B$6-(U21/2)","v":59.452501700149647},{"$f":"Temperaturen!$B$2+Temperaturen!$B$6-(V21/2)","v":59.008029658792054},{"$f":"Temperaturen!$B$2+Temperaturen!$B$6-(W21/2)","v":59.238352143930683}]
["Sonne  Azimut > ",-30,"Diff. Solarkreis (K) > ",{"$f":"Sommer!D32/(3.7*($B$9/3600))","v":10.18876692052703},{"$f":"Sommer!E32/(3.7*($B$9/3600))","v":9.3235591279906025},{"$f":"Sommer!F32/(3.7*($B$9/3600))","v":9.893817989584706},{"$f":"Sommer!G32/(3.7*($B$9/3600))","v":9.2436530997204152},{"$f":"Sommer!H32/(3.7*($B$9/3600))","v":8.8653999029123014},{"$f":"Sommer!I32/(3.7*($B$9/3600))","v":7.3261761952411737},null,{"$f":"Herbstfrühjahr!D32/(3.7*(Temperaturen!$B$9/3600))","v":8.8312393874724364},{"$f":"Herbstfrühjahr!E32/(3.7*(Temperaturen!$B$9/3600))","v":8.0683967299083434},{"$f":"Herbstfrühjahr!F32/(3.7*(Temperaturen!$B$9/3600))","v":8.5835549802399473},{"$f":"Herbstfrühjahr!G32/(3.7*(Temperaturen!$B$9/3600))","v":7.9853109118210659},{"$f":"Herbstfrühjahr!H32/(3.7*(Temperaturen!$B$9/3600))","v":7.7291903047413149},{"$f":"Herbstfrühjahr!I32/(3.7*(Temperaturen!$B$9/3600))","v":6.3673408439425838},null,{"$f":"Winter!D32/(3.7*(Temperaturen!$B$9/3600))","v":3.5154494287832443},{"$f":"Winter!E32/(3.7*(Temperaturen!$B$9/3600))","v":3.1118605312902479},{"$f":"Winter!F32/(3.7*(Temperaturen!$B$9/3600))","v":3.3923760435860242},{"$f":"Winter!G32/(3.7*(Temperaturen!$B$9/3600))","v":3.041500879090401},{"$f":"Winter!H32/(3.7*(Temperaturen!$B$9/3600))","v":3.5576157866276903},{"$f":"Winter!I32/(3.7*(Temperaturen!$B$9/3600))","v":2.7391139923108763}]
[null,null,"Solar VL Temperatur (°C) > ",{"$f":"$B$2+$B$6+(D24/2)","v":65.094383460263515},64.661779563995296,64.946908994792352,64.621826549860202,64.432699951456158,63.663088097620587,null,{"$f":"Temperaturen!$B$2+Temperaturen!$B$6+(K24/2)","v":64.415619693736218},{"$f":"Temperaturen!$B$2+Temperaturen!$B$6+(L24/2)","v":64.034198364954165},{"$f":"Temperaturen!$B$2+Temperaturen!$B$6+(M24/2)","v":64.291777490119969},{"$f":"Temperaturen!$B$2+Temperaturen!$B$6+(N24/2)","v":63.99265545591053},{"$f":"Temperaturen!$B$2+Temperaturen!$B$6+(O24/2)","v":63.864595152370654},{"$f":"Temperaturen!$B$2+Temperaturen!$B$6+(P24/2)","v":63.183670421971293},null,{"$f":"Temperaturen!$B$2+Temperaturen!$B$6+(R24/2)","v":61.757724714391621},{"$f":"Temperaturen!$B$2+Temperaturen!$B$6+(S24/2)","v":61.555930265645124},{"$f":"Temperaturen!$B$2+Temperaturen!$B$6+(T24/2)","v":61.696188021793013},{"$f":"Temperaturen!$B$2+Temperaturen!$B$6+(U24/2)","v":61.520750439545203},{"$f":"Temperaturen!$B$2+Temperaturen!$B$6+(V24/2)","v":61.778807893313846},{"$f":"Temperaturen!$B$2+Temperaturen!$B$6+(W24/2)","v":61.369556996155438}]
[null,null,"Solar RL Temperatur (°C) > ",{"$f":"$B$2+$B$6-(D24/2)","v":54.905616539736485},55.338220436004697,55.053091005207648,55.378173450139791,55.567300048543849,56.336911902379413,null,{"$f":"Temperaturen!$B$2+Temperaturen!$B$6-(K24/2)","v":55.584380306263782},{"$f":"Temperaturen!$B$2+Temperaturen!$B$6-(L24/2)","v":55.965801635045828},{"$f":"Temperaturen!$B$2+Temperaturen!$B$6-(M24/2)","v":55.708222509880024},{"$f":"Temperaturen!$B$2+Temperaturen!$B$6-(N24/2)","v":56.00734454408947},{"$f":"Temperaturen!$B$2+Temperaturen!$B$6-(O24/2)","v":56.135404847629346},{"$f":"Temperaturen!$B$2+Temperaturen!$B$6-(P24/2)","v":56.816329578028707},null,{"$f":"Temperaturen!$B$2+Temperaturen!$B$6-(R24/2)","v":58.242275285608379},{"$f":"Temperaturen!$B$2+Temperaturen!$B$6-(S24/2)","v":58.444069734354876},{"$f":"Temperaturen!$B$2+Temperaturen!$B$6-(T24/2)","v":58.303811978206987},{"$f":"Temperaturen!$B$2+Temperaturen!$B$6-(U24/2)","v":58.479249560454797},{"$f":"Temperaturen!$B$2+Temperaturen!$B$6-(V24/2)","v":58.221192106686154},{"$f":"Temperaturen!$B$2+Temperaturen!$B$6-(W24/2)","v":58.630443003844562}]
["Sonne  Azimut > ",-20,"Diff. Solarkreis (K) > ",{"$f":"Sommer!D33/(3.7*($B$9/3600))","v":10.578836201351352},{"$f":"Sommer!E33/(3.7*($B$9/3600))","v":9.6876896488836692},{"$f":"Sommer!F33/(3.7*($B$9/3600))","v":10.276602124966569},{"$f":"Sommer!G33/(3.7*($B$9/3600))","v":9.6058626091865289},{"$f":"Sommer!H33/(3.7*($B$9/3600))","v":8.9920091766188683},{"$f":"Sommer!I33/(3.7*($B$9/3600))","v":6.7978590692440202},null,{"$f":"Herbstfrühjahr!D33/(3.7*(Temperaturen!$B$9/3600))","v":9.7427440041081113},{"$f":"Herbstfrühjahr!E33/(3.7*(Temperaturen!$B$9/3600))","v":8.9210230466933016},{"$f":"Herbstfrühjahr!F33/(3.7*(Temperaturen!$B$9/3600))","v":9.478191774335059},{"$f":"Herbstfrühjahr!G33/(3.7*(Temperaturen!$B$9/3600))","v":8.833923252369063},{"$f":"Herbstfrühjahr!H33/(3.7*(Temperaturen!$B$9/3600))","v":8.2648717664247133},{"$f":"Herbstfrühjahr!I33/(3.7*(Temperaturen!$B$9/3600))","v":6.2521179353333514},null,{"$f":"Winter!D33/(3.7*(Temperaturen!$B$9/3600))","v":4.902533359783785},{"$f":"Winter!E33/(3.7*(Temperaturen!$B$9/3600))","v":4.4097114111398366},{"$f":"Winter!F33/(3.7*(Temperaturen!$B$9/3600))","v":4.7534996741885287},{"$f":"Winter!G33/(3.7*(Temperaturen!$B$9/3600))","v":4.3334297390046617},{"$f":"Winter!H33/(3.7*(Temperaturen!$B$9/3600))","v":4.5277603599150584},{"$f":"Winter!I33/(3.7*(Temperaturen!$B$9/3600))","v":3.2887910647988612}]
[null,null,"Solar VL Temperatur (°C) > ",{"$f":"$B$2+$B$6+(D27/2)","v":65.289418100675675},64.843844824441831,65.138301062483279,64.802931304593258,64.496004588309432,63.398929534622013,null,{"$f":"Temperaturen!$B$2+Temperaturen!$B$6+(K27/2)","v":64.871372002054059},{"$f":"Temperaturen!$B$2+Temperaturen!$B$6+(L27/2)","v":64.460511523346653},{"$f":"Temperaturen!$B$2+Temperaturen!$B$6+(M27/2)","v":64.739095887167537},{"$f":"Temperaturen!$B$2+Temperaturen!$B$6+(N27/2)","v":64.416961626184531},{"$f":"Temperaturen!$B$2+Temperaturen!$B$6+(O27/2)","v":64.132435883212352},{"$f":"Temperaturen!$B$2+Temperaturen!$B$6+(P27/2)","v":63.126058967666673},null,{"$f":"Temperaturen!$B$2+Temperaturen!$B$6+(R27/2)","v":62.451266679891894},{"$f":"Temperaturen!$B$2+Temperaturen!$B$6+(S27/2)","v":62.204855705569919},{"$f":"Temperaturen!$B$2+Temperaturen!$B$6+(T27/2)","v":62.376749837094266},{"$f":"Temperaturen!$B$2+Temperaturen!$B$6+(U27/2)","v":62.166714869502329},{"$f":"Temperaturen!$B$2+Temperaturen!$B$6+(V27/2)","v":62.263880179957532},{"$f":"Temperaturen!$B$2+Temperaturen!$B$6+(W27/2)","v":61.644395532399429}]
[null,null,"Solar RL Temperatur (°C) > ",{"$f":"$B$2+$B$6-(D27/2)","v":54.710581899324325},55.156155175558169,54.861698937516714,55.197068695406735,55.503995411690568,56.601070465377987,null,{"$f":"Temperaturen!$B$2+Temperaturen!$B$6-(K27/2)","v":55.128627997945941},{"$f":"Temperaturen!$B$2+Temperaturen!$B$6-(L27/2)","v":55.539488476653347},{"$f":"Temperaturen!$B$2+Temperaturen!$B$6-(M27/2)","v":55.260904112832471},{"$f":"Temperaturen!$B$2+Temperaturen!$B$6-(N27/2)","v":55.583038373815469},{"$f":"Temperaturen!$B$2+Temperaturen!$B$6-(O27/2)","v":55.867564116787641},{"$f":"Temperaturen!$B$2+Temperaturen!$B$6-(P27/2)","v":56.873941032333327},null,{"$f":"Temperaturen!$B$2+Temperaturen!$B$6-(R27/2)","v":57.548733320108106},{"$f":"Temperaturen!$B$2+Temperaturen!$B$6-(S27/2)","v":57.795144294430081},{"$f":"Temperaturen!$B$2+Temperaturen!$B$6-(T27/2)","v":57.623250162905734},{"$f":"Temperaturen!$B$2+Temperaturen!$B$6-(U27/2)","v":57.833285130497671},{"$f":"Temperaturen!$B$2+Temperaturen!$B$6-(V27/2)","v":57.736119820042468},{"$f":"Temperaturen!$B$2+Temperaturen!$B$6-(W27/2)","v":58.355604467600571}]
["Sonne  Azimut > ",-10,"Diff. Solarkreis (K) > ",{"$f":"Sommer!D34/(3.7*($B$9/3600))","v":10.748517190540543},{"$f":"Sommer!E34/(3.7*($B$9/3600))","v":9.9461005687426542},{"$f":"Sommer!F34/(3.7*($B$9/3600))","v":10.548622372163104},{"$f":"Sommer!G34/(3.7*($B$9/3600))","v":9.8627870589801621},{"$f":"Sommer!H34/(3.7*($B$9/3600))","v":9.1181830160452328},{"$f":"Sommer!I34/(3.7*($B$9/3600))","v":6.6343845157118828},null,{"$f":"Herbstfrühjahr!D34/(3.7*(Temperaturen!$B$9/3600))","v":10.186525052756759},{"$f":"Herbstfrühjahr!E34/(3.7*(Temperaturen!$B$9/3600))","v":9.4310486937720359},{"$f":"Herbstfrühjahr!F34/(3.7*(Temperaturen!$B$9/3600))","v":10.013881108352955},{"$f":"Herbstfrühjahr!G34/(3.7*(Temperaturen!$B$9/3600))","v":9.3413431215018008},{"$f":"Herbstfrühjahr!H34/(3.7*(Temperaturen!$B$9/3600))","v":8.5948648849244353},{"$f":"Herbstfrühjahr!I34/(3.7*(Temperaturen!$B$9/3600))","v":6.2679113373231603},null,{"$f":"Winter!D34/(3.7*(Temperaturen!$B$9/3600))","v":5.9441135857297303},{"$f":"Winter!E34/(3.7*(Temperaturen!$B$9/3600))","v":5.4398175210340787},{"$f":"Winter!F34/(3.7*(Temperaturen!$B$9/3600))","v":5.8341034061964407},{"$f":"Winter!G34/(3.7*(Temperaturen!$B$9/3600))","v":5.3587143455731612},{"$f":"Winter!H34/(3.7*(Temperaturen!$B$9/3600))","v":5.3022736203938239},{"$f":"Winter!I34/(3.7*(Temperaturen!$B$9/3600))","v":3.7637551660261233}]
[null,null,"Solar VL Temperatur (°C) > ",{"$f":"$B$2+$B$6+(D30/2)","v":65.374258595270277},64.973050284371325,65.274311186081547,64.93139352949008,64.559091508022618,63.317192257855943,null,{"$f":"Temperaturen!$B$2+Temperaturen!$B$6+(K30/2)","v":65.093262526378382},{"$f":"Temperaturen!$B$2+Temperaturen!$B$6+(L30/2)","v":64.715524346886014},{"$f":"Temperaturen!$B$2+Temperaturen!$B$6+(M30/2)","v":65.006940554176481},{"$f":"Temperaturen!$B$2+Temperaturen!$B$6+(N30/2)","v":64.670671560750904},{"$f":"Temperaturen!$B$2+Temperaturen!$B$6+(O30/2)","v":64.297432442462224},{"$f":"Temperaturen!$B$2+Temperaturen!$B$6+(P30/2)","v":63.133955668661578},null,{"$f":"Temperaturen!$B$2+Temperaturen!$B$6+(R30/2)","v":62.972056792864862},{"$f":"Temperaturen!$B$2+Temperaturen!$B$6+(S30/2)","v":62.719908760517036},{"$f":"Temperaturen!$B$2+Temperaturen!$B$6+(T30/2)","v":62.917051703098224},{"$f":"Temperaturen!$B$2+Temperaturen!$B$6+(U30/2)","v":62.679357172786581},{"$f":"Temperaturen!$B$2+Temperaturen!$B$6+(V30/2)","v":62.65113681019691},{"$f":"Temperaturen!$B$2+Temperaturen!$B$6+(W30/2)","v":61.881877583013065}]
[null,null,"Solar RL Temperatur (°C) > ",{"$f":"$B$2+$B$6-(D30/2)","v":54.62574140472973},55.026949715628675,54.725688813918445,55.06860647050992,55.440908491977382,56.682807742144057,null,{"$f":"Temperaturen!$B$2+Temperaturen!$B$6-(K30/2)","v":54.906737473621618},{"$f":"Temperaturen!$B$2+Temperaturen!$B$6-(L30/2)","v":55.284475653113979},{"$f":"Temperaturen!$B$2+Temperaturen!$B$6-(M30/2)","v":54.993059445823519},{"$f":"Temperaturen!$B$2+Temperaturen!$B$6-(N30/2)","v":55.329328439249096},{"$f":"Temperaturen!$B$2+Temperaturen!$B$6-(O30/2)","v":55.702567557537783},{"$f":"Temperaturen!$B$2+Temperaturen!$B$6-(P30/2)","v":56.866044331338422},null,{"$f":"Temperaturen!$B$2+Temperaturen!$B$6-(R30/2)","v":57.027943207135138},{"$f":"Temperaturen!$B$2+Temperaturen!$B$6-(S30/2)","v":57.280091239482964},{"$f":"Temperaturen!$B$2+Temperaturen!$B$6-(T30/2)","v":57.082948296901776},{"$f":"Temperaturen!$B$2+Temperaturen!$B$6-(U30/2)","v":57.320642827213419},{"$f":"Temperaturen!$B$2+Temperaturen!$B$6-(V30/2)","v":57.34886318980309},{"$f":"Temperaturen!$B$2+Temperaturen!$B$6-(W30/2)","v":58.118122416986935}]
["Sonne  Azimut > ",0,"Diff. Solarkreis (K) > ",{"$f":"Sommer!D35/(3.7*($B$9/3600))","v":10.787674341891895},{"$f":"Sommer!E35/(3.7*($B$9/3600))","v":9.9831518307873104},{"$f":"Sommer!F35/(3.7*($B$9/3600))","v":10.587441491854221},{"$f":"Sommer!G35/(3.7*($B$9/3600))","v":9.8996860284915478},{"$f":"Sommer!H35/(3.7*($B$9/3600))","v":9.0567327286265904},{"$f":"Sommer!I35/(3.7*($B$9/3600))","v":6.6569956459847415},null,{"$f":"Herbstfrühjahr!D35/(3.7*(Temperaturen!$B$9/3600))","v":10.33010127437838},{"$f":"Herbstfrühjahr!E35/(3.7*(Temperaturen!$B$9/3600))","v":9.5669033212690966},{"$f":"Herbstfrühjahr!F35/(3.7*(Temperaturen!$B$9/3600))","v":10.156217880553724},{"$f":"Herbstfrühjahr!G35/(3.7*(Temperaturen!$B$9/3600))","v":9.4766393430435372},{"$f":"Herbstfrühjahr!H35/(3.7*(Temperaturen!$B$9/3600))","v":8.615472638058467},{"$f":"Herbstfrühjahr!I35/(3.7*(Temperaturen!$B$9/3600))","v":6.3508188149903022},null,{"$f":"Winter!D35/(3.7*(Temperaturen!$B$9/3600))","v":6.1425098192432444},{"$f":"Winter!E35/(3.7*(Temperaturen!$B$9/3600))","v":5.6275439153936544},{"$f":"Winter!F35/(3.7*(Temperaturen!$B$9/3600))","v":6.0307869459647803},{"$f":"Winter!G35/(3.7*(Temperaturen!$B$9/3600))","v":5.5456691244308365},{"$f":"Winter!H35/(3.7*(Temperaturen!$B$9/3600))","v":5.3958415403199123},{"$f":"Winter!I35/(3.7*(Temperaturen!$B$9/3600))","v":3.8783182260752618}]
[null,null,"Solar VL Temperatur (°C) > ",{"$f":"$B$2+$B$6+(D33/2)","v":65.393837170945943},64.991575915393653,65.293720745927118,64.949843014245772,64.5283663643133,63.328497822992368,null,{"$f":"Temperaturen!$B$2+Temperaturen!$B$6+(K33/2)","v":65.165050637189196},{"$f":"Temperaturen!$B$2+Temperaturen!$B$6+(L33/2)","v":64.783451660634555},{"$f":"Temperaturen!$B$2+Temperaturen!$B$6+(M33/2)","v":65.078108940276863},{"$f":"Temperaturen!$B$2+Temperaturen!$B$6+(N33/2)","v":64.738319671521765},{"$f":"Temperaturen!$B$2+Temperaturen!$B$6+(O33/2)","v":64.307736319029232},{"$f":"Temperaturen!$B$2+Temperaturen!$B$6+(P33/2)","v":63.175409407495152},null,{"$f":"Temperaturen!$B$2+Temperaturen!$B$6+(R33/2)","v":63.071254909621622},{"$f":"Temperaturen!$B$2+Temperaturen!$B$6+(S33/2)","v":62.813771957696829},{"$f":"Temperaturen!$B$2+Temperaturen!$B$6+(T33/2)","v":63.015393472982389},{"$f":"Temperaturen!$B$2+Temperaturen!$B$6+(U33/2)","v":62.772834562215415},{"$f":"Temperaturen!$B$2+Temperaturen!$B$6+(V33/2)","v":62.697920770159953},{"$f":"Temperaturen!$B$2+Temperaturen!$B$6+(W33/2)","v":61.939159113037633}]
[null,null,"Solar RL Temperatur (°C) > ",{"$f":"$B$2+$B$6-(D33/2)","v":54.60616282905405},55.008424084606347,54.706279254072889,55.050156985754228,55.471633635686707,56.671502177007632,null,{"$f":"Temperaturen!$B$2+Temperaturen!$B$6-(K33/2)","v":54.834949362810811},{"$f":"Temperaturen!$B$2+Temperaturen!$B$6-(L33/2)","v":55.216548339365453},{"$f":"Temperaturen!$B$2+Temperaturen!$B$6-(M33/2)","v":54.921891059723137},{"$f":"Temperaturen!$B$2+Temperaturen!$B$6-(N33/2)","v":55.261680328478235},{"$f":"Temperaturen!$B$2+Temperaturen!$B$6-(O33/2)","v":55.692263680970768},{"$f":"Temperaturen!$B$2+Temperaturen!$B$6-(P33/2)","v":56.824590592504848},null,{"$f":"Temperaturen!$B$2+Temperaturen!$B$6-(R33/2)","v":56.928745090378378},{"$f":"Temperaturen!$B$2+Temperaturen!$B$6-(S33/2)","v":57.186228042303171},{"$f":"Temperaturen!$B$2+Temperaturen!$B$6-(T33/2)","v":56.984606527017611},{"$f":"Temperaturen!$B$2+Temperaturen!$B$6-(U33/2)","v":57.227165437784585},{"$f":"Temperaturen!$B$2+Temperaturen!$B$6-(V33/2)","v":57.302079229840047},{"$f":"Temperaturen!$B$2+Temperaturen!$B$6-(W33/2)","v":58.060840886962367}]
["Sonne  Azimut > ",10,"Diff. Solarkreis (K) > ",{"$f":"Sommer!D36/(3.7*($B$9/3600))","v":10.748517190540543},{"$f":"Sommer!E36/(3.7*($B$9/3600))","v":9.9461005687426542},{"$f":"Sommer!F36/(3.7*($B$9/3600))","v":10.548622372163104},{"$f":"Sommer!G36/(3.7*($B$9/3600))","v":9.8627870589801621},{"$f":"Sommer!H36/(3.7*($B$9/3600))","v":9.1181830160452328},{"$f":"Sommer!I36/(3.7*($B$9/3600))","v":6.6343845157118828},null,{"$f":"Herbstfrühjahr!D36/(3.7*(Temperaturen!$B$9/3600))","v":10.186525052756759},{"$f":"Herbstfrühjahr!E36/(3.7*(Temperaturen!$B$9/3600))","v":9.4310486937720359},{"$f":"Herbstfrühjahr!F36/(3.7*(Temperaturen!$B$9/3600))","v":10.013881108352955},{"$f":"Herbstfrühjahr!G36/(3.7*(Temperaturen!$B$9/3600))","v":9.3413431215018008},{"$f":"Herbstfrühjahr!H36/(3.7*(Temperaturen!$B$9/3600))","v":8.5948648849244353},{"$f":"Herbstfrühjahr!I36/(3.7*(Temperaturen!$B$9/3600))","v":6.2679113373231603},null,{"$f":"Winter!D36/(3.7*(Temperaturen!$B$9/3600))","v":5.9441135857297303},{"$f":"Winter!E36/(3.7*(Temperaturen!$B$9/3600))","v":5.4398175210340787},{"$f":"Winter!F36/(3.7*(Temperaturen!$B$9/3600))","v":5.8341034061964407},{"$f":"Winter!G36/(3.7*(Temperaturen!$B$9/3600))","v":5.3587143455731612},{"$f":"Winter!H36/(3.7*(Temperaturen!$B$9/3600))","v":5.3022736203938239},{"$f":"Winter!I36/(3.7*(Temperaturen!$B$9/3600))","v":3.7637551660261233}]
[null,null,"Solar VL Temperatur (°C) > ",{"$f":"$B$2+$B$6+(D36/2)","v":65.374258595270277},64.973050284371325,65.274311186081547,64.93139352949008,64.559091508022618,63.317192257855943,null,{"$f":"Temperaturen!$B$2+Temperaturen!$B$6+(K36/2)","v":65.093262526378382},{"$f":"Temperaturen!$B$2+Temperaturen!$B$6+(L36/2)","v":64.715524346886014},{"$f":"Temperaturen!$B$2+Temperaturen!$B$6+(M36/2)","v":65.006940554176481},{"$f":"Temperaturen!$B$2+Temperaturen!$B$6+(N36/2)","v":64.670671560750904},{"$f":"Temperaturen!$B$2+Temperaturen!$B$6+(O36/2)","v":64.297432442462224},{"$f":"Temperaturen!$B$2+Temperaturen!$B$6+(P36/2)","v":63.133955668661578},null,{"$f":"Temperaturen!$B$2+Temperaturen!$B$6+(R36/2)","v":62.972056792864862},{"$f":"Temperaturen!$B$2+Temperaturen!$B$6+(S36/2)","v":62.719908760517036},{"$f":"Temperaturen!$B$2+Temperaturen!$B$6+(T36/2)","v":62.917051703098224},{"$f":"Temperaturen!$B$2+Temperaturen!$B$6+(U36/2)","v":62.679357172786581},{"$f":"Temperaturen!$B$2+Temperaturen!$B$6+(V36/2)","v":62.65113681019691},{"$f":"Temperaturen!$B$2+Temperaturen!$B$6+(W36/2)","v":61.881877583013065}]
[null,null,"Solar RL Temperatur (°C) > ",{"$f":"$B$2+$B$6-(D36/2)","v":54.62574140472973},55.026949715628675,54.725688813918445,55.06860647050992,55.440908491977382,56.682807742144057,null,{"$f":"Temperaturen!$B$2+Temperaturen!$B$6-(K36/2)","v":54.906737473621618},{"$f":"Temperaturen!$B$2+Temperaturen!$B$6-(L36/2)","v":55.284475653113979},{"$f":"Temperaturen!$B$2+Temperaturen!$B$6-(M36/2)","v":54.993059445823519},{"$f":"Temperaturen!$B$2+Temperaturen!$B$6-(N36/2)","v":55.329328439249096},{"$f":"Temperaturen!$B$2+Temperaturen!$B$6-(O36/2)","v":55.702567557537783},{"$f":"Temperaturen!$B$2+Temperaturen!$B$6-(P36/2)","v":56.866044331338422},null,{"$f":"Temperaturen!$B$2+Temperaturen!$B$6-(R36/2)","v":57.027943207135138},{"$f":"Temperaturen!$B$2+Temperaturen!$B$6-(S36/2)","v":57.280091239482964},{"$f":"Temperaturen!$B$2+Temperaturen!$B$6-(T36/2)","v":57.082948296901776},{"$f":"Temperaturen!$B$2+Temperaturen!$B$6-(U36/2)","v":57.320642827213419},{"$f":"Temperaturen!$B$2+Temperaturen!$B$6-(V36/2)","v":57.34886318980309},{"$f":"Temperaturen!$B$2+Temperaturen!$B$6-(W36/2)","v":58.118122416986935}]
["Sonne  Azimut > ",20,"Diff. Solarkreis (K) > ",{"$f":"Sommer!D37/(3.7*($B$9/3600))","v":10.578836201351352},{"$f":"Sommer!E37/(3.7*($B$9/3600))","v":9.6876896488836692},{"$f":"Sommer!F37/(3.7*($B$9/3600))","v":10.276602124966569},{"$f":"Sommer!G37/(3.7*($B$9/3600))","v":9.6058626091865289},{"$f":"Sommer!H37/(3.7*($B$9/3600))","v":8.9920091766188683},{"$f":"Sommer!I37/(3.7*($B$9/3600))","v":6.7978590692440202},null,{"$f":"Herbstfrühjahr!D37/(3.7*(Temperaturen!$B$9/3600))","v":9.7427440041081113},{"$f":"Herbstfrühjahr!E37/(3.7*(Temperaturen!$B$9/3600))","v":8.9210230466933016},{"$f":"Herbstfrühjahr!F37/(3.7*(Temperaturen!$B$9/3600))","v":9.478191774335059},{"$f":"Herbstfrühjahr!G37/(3.7*(Temperaturen!$B$9/3600))","v":8.833923252369063},{"$f":"Herbstfrühjahr!H37/(3.7*(Temperaturen!$B$9/3600))","v":8.2648717664247133},{"$f":"Herbstfrühjahr!I37/(3.7*(Temperaturen!$B$9/3600))","v":6.2521179353333514},null,{"$f":"Winter!D37/(3.7*(Temperaturen!$B$9/3600))","v":4.902533359783785},{"$f":"Winter!E37/(3.7*(Temperaturen!$B$9/3600))","v":4.4097114111398366},{"$f":"Winter!F37/(3.7*(Temperaturen!$B$9/3600))","v":4.7534996741885287},{"$f":"Winter!G37/(3.7*(Temperaturen!$B$9/3600))","v":4.3334297390046617},{"$f":"Winter!H37/(3.7*(Temperaturen!$B$9/3600))","v":4.5277603599150584},{"$f":"Winter!I37/(3.7*(Temperaturen!$B$9/3600))","v":3.2887910647988612}]
[null,null,"Solar VL Temperatur (°C) > ",{"$f":"$B$2+$B$6+(D39/2)","v":65.289418100675675},64.843844824441831,65.138301062483279,64.802931304593258,64.496004588309432,63.398929534622013,null,{"$f":"Temperaturen!$B$2+Temperaturen!$B$6+(K39/2)","v":64.871372002054059},{"$f":"Temperaturen!$B$2+Temperaturen!$B$6+(L39/2)","v":64.460511523346653},{"$f":"Temperaturen!$B$2+Temperaturen!$B$6+(M39/2)","v":64.739095887167537},{"$f":"Temperaturen!$B$2+Temperaturen!$B$6+(N39/2)","v":64.416961626184531},{"$f":"Temperaturen!$B$2+Temperaturen!$B$6+(O39/2)","v":64.132435883212352},{"$f":"Temperaturen!$B$2+Temperaturen!$B$6+(P39/2)","v":63.126058967666673},null,{"$f":"Temperaturen!$B$2+Temperaturen!$B$6+(R39/2)","v":62.451266679891894},{"$f":"Temperaturen!$B$2+Temperaturen!$B$6+(S39/2)","v":62.204855705569919},{"$f":"Temperaturen!$B$2+Temperaturen!$B$6+(T39/2)","v":62.376749837094266},{"$f":"Temperaturen!$B$2+Temperaturen!$B$6+(U39/2)","v":62.166714869502329},{"$f":"Temperaturen!$B$2+Temperaturen!$B$6+(V39/2)","v":62.263880179957532},{"$f":"Temperaturen!$B$2+Temperaturen!$B$6+(W39/2)","v":61.644395532399429}]
[null,null,"Solar RL Temperatur (°C) > ",{"$f":"$B$2+$B$6-(D39/2)","v":54.710581899324325},55.156155175558169,54.861698937516714,55.197068695406735,55.503995411690568,56.601070465377987,null,{"$f":"Temperaturen!$B$2+Temperaturen!$B$6-(K39/2)","v":55.128627997945941},{"$f":"Temperaturen!$B$2+Temperaturen!$B$6-(L39/2)","v":55.539488476653347},{"$f":"Temperaturen!$B$2+Temperaturen!$B$6-(M39/2)","v":55.260904112832471},{"$f":"Temperaturen!$B$2+Temperaturen!$B$6-(N39/2)","v":55.583038373815469},{"$f":"Temperaturen!$B$2+Temperaturen!$B$6-(O39/2)","v":55.867564116787641},{"$f":"Temperaturen!$B$2+Temperaturen!$B$6-(P39/2)","v":56.873941032333327},null,{"$f":"Temperaturen!$B$2+Temperaturen!$B$6-(R39/2)","v":57.548733320108106},{"$f":"Temperaturen!$B$2+Temperaturen!$B$6-(S39/2)","v":57.795144294430081},{"$f":"Temperaturen!$B$2+Temperaturen!$B$6-(T39/2)","v":57.623250162905734},{"$f":"Temperaturen!$B$2+Temperaturen!$B$6-(U39/2)","v":57.833285130497671},{"$f":"Temperaturen!$B$2+Temperaturen!$B$6-(V39/2)","v":57.736119820042468},{"$f":"Temperaturen!$B$2+Temperaturen!$B$6-(W39/2)","v":58.355604467600571}]
["Sonne  Azimut > ",30,"Diff. Solarkreis (K) > ",{"$f":"Sommer!D38/(3.7*($B$9/3600))","v":10.18876692052703},{"$f":"Sommer!E38/(3.7*($B$9/3600))","v":9.3235591279906025},{"$f":"Sommer!F38/(3.7*($B$9/3600))","v":9.893817989584706},{"$f":"Sommer!G38/(3.7*($B$9/3600))","v":9.2436530997204152},{"$f":"Sommer!H38/(3.7*($B$9/3600))","v":8.8653999029123014},{"$f":"Sommer!I38/(3.7*($B$9/3600))","v":7.3261761952411737},null,{"$f":"Herbstfrühjahr!D38/(3.7*(Temperaturen!$B$9/3600))","v":8.8312393874724364},{"$f":"Herbstfrühjahr!E38/(3.7*(Temperaturen!$B$9/3600))","v":8.0683967299083434},{"$f":"Herbstfrühjahr!F38/(3.7*(Temperaturen!$B$9/3600))","v":8.5835549802399473},{"$f":"Herbstfrühjahr!G38/(3.7*(Temperaturen!$B$9/3600))","v":7.9853109118210659},{"$f":"Herbstfrühjahr!H38/(3.7*(Temperaturen!$B$9/3600))","v":7.7291903047413149},{"$f":"Herbstfrühjahr!I38/(3.7*(Temperaturen!$B$9/3600))","v":6.3673408439425838},null,{"$f":"Winter!D38/(3.7*(Temperaturen!$B$9/3600))","v":3.5154494287832443},{"$f":"Winter!E38/(3.7*(Temperaturen!$B$9/3600))","v":3.1118605312902479},{"$f":"Winter!F38/(3.7*(Temperaturen!$B$9/3600))","v":3.3923760435860242},{"$f":"Winter!G38/(3.7*(Temperaturen!$B$9/3600))","v":3.041500879090401},{"$f":"Winter!H38/(3.7*(Temperaturen!$B$9/3600))","v":3.5576157866276903},{"$f":"Winter!I38/(3.7*(Temperaturen!$B$9/3600))","v":2.7391139923108763}]
[null,null,"Solar VL Temperatur (°C) > ",{"$f":"$B$2+$B$6+(D42/2)","v":65.094383460263515},64.661779563995296,64.946908994792352,64.621826549860202,64.432699951456158,63.663088097620587,null,{"$f":"Temperaturen!$B$2+Temperaturen!$B$6+(K42/2)","v":64.415619693736218},{"$f":"Temperaturen!$B$2+Temperaturen!$B$6+(L42/2)","v":64.034198364954165},{"$f":"Temperaturen!$B$2+Temperaturen!$B$6+(M42/2)","v":64.291777490119969},{"$f":"Temperaturen!$B$2+Temperaturen!$B$6+(N42/2)","v":63.99265545591053},{"$f":"Temperaturen!$B$2+Temperaturen!$B$6+(O42/2)","v":63.864595152370654},{"$f":"Temperaturen!$B$2+Temperaturen!$B$6+(P42/2)","v":63.183670421971293},null,{"$f":"Temperaturen!$B$2+Temperaturen!$B$6+(R42/2)","v":61.757724714391621},{"$f":"Temperaturen!$B$2+Temperaturen!$B$6+(S42/2)","v":61.555930265645124},{"$f":"Temperaturen!$B$2+Temperaturen!$B$6+(T42/2)","v":61.696188021793013},{"$f":"Temperaturen!$B$2+Temperaturen!$B$6+(U42/2)","v":61.520750439545203},{"$f":"Temperaturen!$B$2+Temperaturen!$B$6+(V42/2)","v":61.778807893313846},{"$f":"Temperaturen!$B$2+Temperaturen!$B$6+(W42/2)","v":61.369556996155438}]
[null,null,"Solar RL Temperatur (°C) > ",{"$f":"$B$2+$B$6-(D42/2)","v":54.905616539736485},55.338220436004697,55.053091005207648,55.378173450139791,55.567300048543849,56.336911902379413,null,{"$f":"Temperaturen!$B$2+Temperaturen!$B$6-(K42/2)","v":55.584380306263782},{"$f":"Temperaturen!$B$2+Temperaturen!$B$6-(L42/2)","v":55.965801635045828},{"$f":"Temperaturen!$B$2+Temperaturen!$B$6-(M42/2)","v":55.708222509880024},{"$f":"Temperaturen!$B$2+Temperaturen!$B$6-(N42/2)","v":56.00734454408947},{"$f":"Temperaturen!$B$2+Temperaturen!$B$6-(O42/2)","v":56.135404847629346},{"$f":"Temperaturen!$B$2+Temperaturen!$B$6-(P42/2)","v":56.816329578028707},null,{"$f":"Temperaturen!$B$2+Temperaturen!$B$6-(R42/2)","v":58.242275285608379},{"$f":"Temperaturen!$B$2+Temperaturen!$B$6-(S42/2)","v":58.444069734354876},{"$f":"Temperaturen!$B$2+Temperaturen!$B$6-(T42/2)","v":58.303811978206987},{"$f":"Temperaturen!$B$2+Temperaturen!$B$6-(U42/2)","v":58.479249560454797},{"$f":"Temperaturen!$B$2+Temperaturen!$B$6-(V42/2)","v":58.221192106686154},{"$f":"Temperaturen!$B$2+Temperaturen!$B$6-(W42/2)","v":58.630443003844562}]
["Sonne  Azimut > ",40,"Diff. Solarkreis (K) > ",{"$f":"Sommer!D39/(3.7*($B$9/3600))","v":9.441456312648647},{"$f":"Sommer!E39/(3.7*($B$9/3600))","v":8.8091239874030549},{"$f":"Sommer!F39/(3.7*($B$9/3600))","v":9.3535576253225337},{"$f":"Sommer!G39/(3.7*($B$9/3600))","v":8.7317567706031145},{"$f":"Sommer!H39/(3.7*($B$9/3600))","v":8.5223377500165469},{"$f":"Sommer!I39/(3.7*($B$9/3600))","v":7.9388289188154673},null,{"$f":"Herbstfrühjahr!D39/(3.7*(Temperaturen!$B$9/3600))","v":7.4359001137816207},{"$f":"Herbstfrühjahr!E39/(3.7*(Temperaturen!$B$9/3600))","v":6.9078744255323166},{"$f":"Herbstfrühjahr!F39/(3.7*(Temperaturen!$B$9/3600))","v":7.3663313015116314},{"$f":"Herbstfrühjahr!G39/(3.7*(Temperaturen!$B$9/3600))","v":6.8300681346334731},{"$f":"Herbstfrühjahr!H39/(3.7*(Temperaturen!$B$9/3600))","v":6.8470304830093793},{"$f":"Herbstfrühjahr!I39/(3.7*(Temperaturen!$B$9/3600))","v":6.3160294820762983},null,{"$f":"Winter!D39/(3.7*(Temperaturen!$B$9/3600))","v":1.3971828503870276},{"$f":"Winter!E39/(3.7*(Temperaturen!$B$9/3600))","v":1.1567326131891895},{"$f":"Winter!F39/(3.7*(Temperaturen!$B$9/3600))","v":1.3426141693696203},{"$f":"Winter!G39/(3.7*(Temperaturen!$B$9/3600))","v":1.0949965997007061},{"$f":"Winter!H39/(3.7*(Temperaturen!$B$9/3600))","v":1.9839406824158852},{"$f":"Winter!I39/(3.7*(Temperaturen!$B$9/3600))","v":1.523295712138627}]
[null,null,"Solar VL Temperatur (°C) > ",{"$f":"$B$2+$B$6+(D45/2)","v":64.720728156324327},64.40456199370152,64.676778812661269,64.365878385301556,64.261168875008281,63.96941445940773,null,{"$f":"Temperaturen!$B$2+Temperaturen!$B$6+(K45/2)","v":63.717950056890814},{"$f":"Temperaturen!$B$2+Temperaturen!$B$6+(L45/2)","v":63.453937212766157},{"$f":"Temperaturen!$B$2+Temperaturen!$B$6+(M45/2)","v":63.683165650755818},{"$f":"Temperaturen!$B$2+Temperaturen!$B$6+(N45/2)","v":63.415034067316739},{"$f":"Temperaturen!$B$2+Temperaturen!$B$6+(O45/2)","v":63.423515241504688},{"$f":"Temperaturen!$B$2+Temperaturen!$B$6+(P45/2)","v":63.158014741038151},null,{"$f":"Temperaturen!$B$2+Temperaturen!$B$6+(R45/2)","v":60.698591425193513},{"$f":"Temperaturen!$B$2+Temperaturen!$B$6+(S45/2)","v":60.578366306594596},{"$f":"Temperaturen!$B$2+Temperaturen!$B$6+(T45/2)","v":60.671307084684813},{"$f":"Temperaturen!$B$2+Temperaturen!$B$6+(U45/2)","v":60.547498299850353},{"$f":"Temperaturen!$B$2+Temperaturen!$B$6+(V45/2)","v":60.991970341207946},{"$f":"Temperaturen!$B$2+Temperaturen!$B$6+(W45/2)","v":60.761647856069317}]
[null,null,"Solar RL Temperatur (°C) > ",{"$f":"$B$2+$B$6-(D45/2)","v":55.279271843675673},55.595438006298473,55.323221187338731,55.634121614698444,55.738831124991727,56.03058554059227,null,{"$f":"Temperaturen!$B$2+Temperaturen!$B$6-(K45/2)","v":56.282049943109186},{"$f":"Temperaturen!$B$2+Temperaturen!$B$6-(L45/2)","v":56.546062787233843},{"$f":"Temperaturen!$B$2+Temperaturen!$B$6-(M45/2)","v":56.316834349244182},{"$f":"Temperaturen!$B$2+Temperaturen!$B$6-(N45/2)","v":56.584965932683261},{"$f":"Temperaturen!$B$2+Temperaturen!$B$6-(O45/2)","v":56.576484758495312},{"$f":"Temperaturen!$B$2+Temperaturen!$B$6-(P45/2)","v":56.841985258961849},null,{"$f":"Temperaturen!$B$2+Temperaturen!$B$6-(R45/2)","v":59.301408574806487},{"$f":"Temperaturen!$B$2+Temperaturen!$B$6-(S45/2)","v":59.421633693405404},{"$f":"Temperaturen!$B$2+Temperaturen!$B$6-(T45/2)","v":59.328692915315187},{"$f":"Temperaturen!$B$2+Temperaturen!$B$6-(U45/2)","v":59.452501700149647},{"$f":"Temperaturen!$B$2+Temperaturen!$B$6-(V45/2)","v":59.008029658792054},{"$f":"Temperaturen!$B$2+Temperaturen!$B$6-(W45/2)","v":59.238352143930683}]
["Sonne  Azimut > ",50,"Diff. Solarkreis (K) > ",{"$f":"Sommer!D40/(3.7*($B$9/3600))","v":8.5699510645135142},{"$f":"Sommer!E40/(3.7*($B$9/3600))","v":7.8981601045358403},{"$f":"Sommer!F40/(3.7*($B$9/3600))","v":8.395289508597795},{"$f":"Sommer!G40/(3.7*($B$9/3600))","v":7.909063496205567},{"$f":"Sommer!H40/(3.7*($B$9/3600))","v":7.6701718427027039},{"$f":"Sommer!I40/(3.7*($B$9/3600))","v":7.7414655592396233},null,{"$f":"Herbstfrühjahr!D40/(3.7*(Temperaturen!$B$9/3600))","v":6.2135615822400005},{"$f":"Herbstfrühjahr!E40/(3.7*(Temperaturen!$B$9/3600))","v":5.684211421405406},{"$f":"Herbstfrühjahr!F40/(3.7*(Temperaturen!$B$9/3600))","v":6.0802974193035118},{"$f":"Herbstfrühjahr!G40/(3.7*(Temperaturen!$B$9/3600))","v":5.6726753774890168},{"$f":"Herbstfrühjahr!H40/(3.7*(Temperaturen!$B$9/3600))","v":5.7592063420540534},{"$f":"Herbstfrühjahr!I40/(3.7*(Temperaturen!$B$9/3600))","v":5.7157555571337406},null,{"$f":"Winter!D40/(3.7*(Temperaturen!$B$9/3600))","v":0},{"$f":"Winter!E40/(3.7*(Temperaturen!$B$9/3600))","v":0},{"$f":"Winter!F40/(3.7*(Temperaturen!$B$9/3600))","v":0},{"$f":"Winter!G40/(3.7*(Temperaturen!$B$9/3600))","v":0},{"$f":"Winter!H40/(3.7*(Temperaturen!$B$9/3600))","v":0.49258848291891899},{"$f":"Winter!I40/(3.7*(Temperaturen!$B$9/3600))","v":5.5019771623535448E-2}]
[null,null,"Solar VL Temperatur (°C) > ",{"$f":"$B$2+$B$6+(D48/2)","v":64.284975532256752},63.949080052267917,64.197644754298892,63.954531748102781,63.83508592135135,63.870732779619814,null,{"$f":"Temperaturen!$B$2+Temperaturen!$B$6+(K48/2)","v":63.106780791120002},{"$f":"Temperaturen!$B$2+Temperaturen!$B$6+(L48/2)","v":62.842105710702704},{"$f":"Temperaturen!$B$2+Temperaturen!$B$6+(M48/2)","v":63.040148709651753},{"$f":"Temperaturen!$B$2+Temperaturen!$B$6+(N48/2)","v":62.836337688744507},{"$f":"Temperaturen!$B$2+Temperaturen!$B$6+(O48/2)","v":62.879603171027028},{"$f":"Temperaturen!$B$2+Temperaturen!$B$6+(P48/2)","v":62.857877778566873},null,{"$f":"Temperaturen!$B$2+Temperaturen!$B$6+(R48/2)","v":60},{"$f":"Temperaturen!$B$2+Temperaturen!$B$6+(S48/2)","v":60},{"$f":"Temperaturen!$B$2+Temperaturen!$B$6+(T48/2)","v":60},{"$f":"Temperaturen!$B$2+Temperaturen!$B$6+(U48/2)","v":60},{"$f":"Temperaturen!$B$2+Temperaturen!$B$6+(V48/2)","v":60.246294241459459},{"$f":"Temperaturen!$B$2+Temperaturen!$B$6+(W48/2)","v":60.027509885811767}]
[null,null,"Solar RL Temperatur (°C) > ",{"$f":"$B$2+$B$6-(D48/2)","v":55.715024467743241},56.050919947732083,55.802355245701101,56.045468251897219,56.16491407864865,56.129267220380186,null,{"$f":"Temperaturen!$B$2+Temperaturen!$B$6-(K48/2)","v":56.893219208879998},{"$f":"Temperaturen!$B$2+Temperaturen!$B$6-(L48/2)","v":57.157894289297296},{"$f":"Temperaturen!$B$2+Temperaturen!$B$6-(M48/2)","v":56.959851290348247},{"$f":"Temperaturen!$B$2+Temperaturen!$B$6-(N48/2)","v":57.163662311255493},{"$f":"Temperaturen!$B$2+Temperaturen!$B$6-(O48/2)","v":57.120396828972972},{"$f":"Temperaturen!$B$2+Temperaturen!$B$6-(P48/2)","v":57.142122221433127},null,{"$f":"Temperaturen!$B$2+Temperaturen!$B$6-(R48/2)","v":60},{"$f":"Temperaturen!$B$2+Temperaturen!$B$6-(S48/2)","v":60},{"$f":"Temperaturen!$B$2+Temperaturen!$B$6-(T48/2)","v":60},{"$f":"Temperaturen!$B$2+Temperaturen!$B$6-(U48/2)","v":60},{"$f":"Temperaturen!$B$2+Temperaturen!$B$6-(V48/2)","v":59.753705758540541},{"$f":"Temperaturen!$B$2+Temperaturen!$B$6-(W48/2)","v":59.972490114188233}]
["Sonne  Azimut > ",60,"Diff. Solarkreis (K) > ",{"$f":"Sommer!D41/(3.7*($B$9/3600))","v":6.953814572837838},{"$f":"Sommer!E41/(3.7*($B$9/3600))","v":6.6839532747356074},{"$f":"Sommer!F41/(3.7*($B$9/3600))","v":7.1180300098502682},{"$f":"Sommer!G41/(3.7*($B$9/3600))","v":6.6182914189854891},{"$f":"Sommer!H41/(3.7*($B$9/3600))","v":7.4209262577220061},{"$f":"Sommer!I41/(3.7*($B$9/3600))","v":6.8297490605912321},null,{"$f":"Herbstfrühjahr!D41/(3.7*(Temperaturen!$B$9/3600))","v":4.1918161733708121},{"$f":"Herbstfrühjahr!E41/(3.7*(Temperaturen!$B$9/3600))","v":3.9639847287426568},{"$f":"Herbstfrühjahr!F41/(3.7*(Temperaturen!$B$9/3600))","v":4.2726784832319424},{"$f":"Herbstfrühjahr!G41/(3.7*(Temperaturen!$B$9/3600))","v":3.9018446320117173},{"$f":"Herbstfrühjahr!H41/(3.7*(Temperaturen!$B$9/3600))","v":4.8285998020077221},{"$f":"Herbstfrühjahr!I41/(3.7*(Temperaturen!$B$9/3600))","v":4.288448449276193},null,{"$f":"Winter!D41/(3.7*(Temperaturen!$B$9/3600))","v":0},{"$f":"Winter!E41/(3.7*(Temperaturen!$B$9/3600))","v":0},{"$f":"Winter!F41/(3.7*(Temperaturen!$B$9/3600))","v":0},{"$f":"Winter!G41/(3.7*(Temperaturen!$B$9/3600))","v":0},{"$f":"Winter!H41/(3.7*(Temperaturen!$B$9/3600))","v":0},{"$f":"Winter!I41/(3.7*(Temperaturen!$B$9/3600))","v":0}]
[null,null,"Solar VL Temperatur (°C) > ",{"$f":"$B$2+$B$6+(D51/2)","v":63.476907286418921},63.341976637367807,63.559015004925136,63.309145709492746,63.710463128861001,63.414874530295613,null,{"$f":"Temperaturen!$B$2+Temperaturen!$B$6+(K51/2)","v":62.095908086685405},{"$f":"Temperaturen!$B$2+Temperaturen!$B$6+(L51/2)","v":61.98199236437133},{"$f":"Temperaturen!$B$2+Temperaturen!$B$6+(M51/2)","v":62.136339241615971},{"$f":"Temperaturen!$B$2+Temperaturen!$B$6+(N51/2)","v":61.950922316005858},{"$f":"Temperaturen!$B$2+Temperaturen!$B$6+(O51/2)","v":62.414299901003858},{"$f":"Temperaturen!$B$2+Temperaturen!$B$6+(P51/2)","v":62.144224224638094},null,{"$f":"Temperaturen!$B$2+Temperaturen!$B$6+(R51/2)","v":60},{"$f":"Temperaturen!$B$2+Temperaturen!$B$6+(S51/2)","v":60},{"$f":"Temperaturen!$B$2+Temperaturen!$B$6+(T51/2)","v":60},{"$f":"Temperaturen!$B$2+Temperaturen!$B$6+(U51/2)","v":60},{"$f":"Temperaturen!$B$2+Temperaturen!$B$6+(V51/2)","v":60},{"$f":"Temperaturen!$B$2+Temperaturen!$B$6+(W51/2)","v":60}]
[null,null,"Solar RL Temperatur (°C) > ",{"$f":"$B$2+$B$6-(D51/2)","v":56.523092713581079},56.658023362632193,56.440984995074864,56.690854290507254,56.289536871138999,56.585125469704387,null,{"$f":"Temperaturen!$B$2+Temperaturen!$B$6-(K51/2)","v":57.904091913314595},{"$f":"Temperaturen!$B$2+Temperaturen!$B$6-(L51/2)","v":58.01800763562867},{"$f":"Temperaturen!$B$2+Temperaturen!$B$6-(M51/2)","v":57.863660758384029},{"$f":"Temperaturen!$B$2+Temperaturen!$B$6-(N51/2)","v":58.049077683994142},{"$f":"Temperaturen!$B$2+Temperaturen!$B$6-(O51/2)","v":57.585700098996142},{"$f":"Temperaturen!$B$2+Temperaturen!$B$6-(P51/2)","v":57.855775775361906},null,{"$f":"Temperaturen!$B$2+Temperaturen!$B$6-(R51/2)","v":60},{"$f":"Temperaturen!$B$2+Temperaturen!$B$6-(S51/2)","v":60},{"$f":"Temperaturen!$B$2+Temperaturen!$B$6-(T51/2)","v":60},{"$f":"Temperaturen!$B$2+Temperaturen!$B$6-(U51/2)","v":60},{"$f":"Temperaturen!$B$2+Temperaturen!$B$6-(V51/2)","v":60},{"$f":"Temperaturen!$B$2+Temperaturen!$B$6-(W51/2)","v":60}]
["Sonne  Azimut > ",70,"Diff. Solarkreis (K) > ",{"$f":"Sommer!D42/(3.7*($B$9/3600))","v":4.82596541768919},{"$f":"Sommer!E42/(3.7*($B$9/3600))","v":4.8248137701527618},{"$f":"Sommer!F42/(3.7*($B$9/3600))","v":5.22185566708918},{"$f":"Sommer!G42/(3.7*($B$9/3600))","v":4.8306747172946372},{"$f":"Sommer!H42/(3.7*($B$9/3600))","v":6.8190990255819095},{"$f":"Sommer!I42/(3.7*($B$9/3600))","v":4.712107342736843},null,{"$f":"Herbstfrühjahr!D42/(3.7*(Temperaturen!$B$9/3600))","v":1.6906344707286487},{"$f":"Herbstfrühjahr!E42/(3.7*(Temperaturen!$B$9/3600))","v":1.5869960182373684},{"$f":"Herbstfrühjahr!F42/(3.7*(Temperaturen!$B$9/3600))","v":1.791102820854694},{"$f":"Herbstfrühjahr!G42/(3.7*(Temperaturen!$B$9/3600))","v":1.5589667022681402},{"$f":"Herbstfrühjahr!H42/(3.7*(Temperaturen!$B$9/3600))","v":3.0953143104423604},{"$f":"Herbstfrühjahr!I42/(3.7*(Temperaturen!$B$9/3600))","v":1.9126123092516749},null,{"$f":"Winter!D42/(3.7*(Temperaturen!$B$9/3600))","v":0},{"$f":"Winter!E42/(3.7*(Temperaturen!$B$9/3600))","v":0},{"$f":"Winter!F42/(3.7*(Temperaturen!$B$9/3600))","v":0},{"$f":"Winter!G42/(3.7*(Temperaturen!$B$9/3600))","v":0},{"$f":"Winter!H42/(3.7*(Temperaturen!$B$9/3600))","v":0},{"$f":"Winter!I42/(3.7*(Temperaturen!$B$9/3600))","v":0}]
[null,null,"Solar VL Temperatur (°C) > ",{"$f":"$B$2+$B$6+(D54/2)","v":62.412982708844595},62.412406885076379,62.610927833544594,62.415337358647321,63.409549512790953,62.356053671368421,null,{"$f":"Temperaturen!$B$2+Temperaturen!$B$6+(K54/2)","v":60.845317235364327},{"$f":"Temperaturen!$B$2+Temperaturen!$B$6+(L54/2)","v":60.793498009118686},{"$f":"Temperaturen!$B$2+Temperaturen!$B$6+(M54/2)","v":60.895551410427345},{"$f":"Temperaturen!$B$2+Temperaturen!$B$6+(N54/2)","v":60.779483351134068},{"$f":"Temperaturen!$B$2+Temperaturen!$B$6+(O54/2)","v":61.547657155221181},{"$f":"Temperaturen!$B$2+Temperaturen!$B$6+(P54/2)","v":60.956306154625835},null,{"$f":"Temperaturen!$B$2+Temperaturen!$B$6+(R54/2)","v":60},{"$f":"Temperaturen!$B$2+Temperaturen!$B$6+(S54/2)","v":60},{"$f":"Temperaturen!$B$2+Temperaturen!$B$6+(T54/2)","v":60},{"$f":"Temperaturen!$B$2+Temperaturen!$B$6+(U54/2)","v":60},{"$f":"Temperaturen!$B$2+Temperaturen!$B$6+(V54/2)","v":60},{"$f":"Temperaturen!$B$2+Temperaturen!$B$6+(W54/2)","v":60}]
[null,null,"Solar RL Temperatur (°C) > ",{"$f":"$B$2+$B$6-(D54/2)","v":57.587017291155405},57.587593114923621,57.389072166455406,57.584662641352679,56.590450487209047,57.643946328631579,null,{"$f":"Temperaturen!$B$2+Temperaturen!$B$6-(K54/2)","v":59.154682764635673},{"$f":"Temperaturen!$B$2+Temperaturen!$B$6-(L54/2)","v":59.206501990881314},{"$f":"Temperaturen!$B$2+Temperaturen!$B$6-(M54/2)","v":59.104448589572655},{"$f":"Temperaturen!$B$2+Temperaturen!$B$6-(N54/2)","v":59.220516648865932},{"$f":"Temperaturen!$B$2+Temperaturen!$B$6-(O54/2)","v":58.452342844778819},{"$f":"Temperaturen!$B$2+Temperaturen!$B$6-(P54/2)","v":59.043693845374165},null,{"$f":"Temperaturen!$B$2+Temperaturen!$B$6-(R54/2)","v":60},{"$f":"Temperaturen!$B$2+Temperaturen!$B$6-(S54/2)","v":60},{"$f":"Temperaturen!$B$2+Temperaturen!$B$6-(T54/2)","v":60},{"$f":"Temperaturen!$B$2+Temperaturen!$B$6-(U54/2)","v":60},{"$f":"Temperaturen!$B$2+Temperaturen!$B$6-(V54/2)","v":60},{"$f":"Temperaturen!$B$2+Temperaturen!$B$6-(W54/2)","v":60}]
["Detailtemperaturen bei allen Winkelfaktoren",null,null,"Detailtemperaturen Sommer bei leicht bewölkt",null,null,null,null,null,null,"Detailtemperaturen Sommer bei leicht bewölkt",null,null,null,null,null,null,"Detailtemperaturen Sommer bei leicht bewölkt"]
["leicht wolkig Azimut > ",-70,"Diff. Solarkreis (K) > ",{"$f":"Sommer!D57/(3.7*($B$9/3600))","v":3.2228390104054059},{"$f":"Sommer!E57/(3.7*($B$9/3600))","v":3.1624471464159822},{"$f":"Sommer!F57/(3.7*($B$9/3600))","v":3.4584001073208404},{"$f":"Sommer!G57/(3.7*($B$9/3600))","v":3.1544467798162721},{"$f":"Sommer!H57/(3.7*($B$9/3600))","v":4.9759327444567027},{"$f":"Sommer!I57/(3.7*($B$9/3600))","v":3.3045079554258385},null,{"$f":"Herbstfrühjahr!D57/(3.7*(Temperaturen!$B$9/3600))","v":0.90931877743135137},{"$f":"Herbstfrühjahr!E57/(3.7*(Temperaturen!$B$9/3600))","v":0.77680842152761453},{"$f":"Herbstfrühjahr!F57/(3.7*(Temperaturen!$B$9/3600))","v":0.93164751089330389},{"$f":"Herbstfrühjahr!G57/(3.7*(Temperaturen!$B$9/3600))","v":0.74202351728611338},{"$f":"Herbstfrühjahr!H57/(3.7*(Temperaturen!$B$9/3600))","v":2.1970103873976825},{"$f":"Herbstfrühjahr!I57/(3.7*(Temperaturen!$B$9/3600))","v":1.2265906167732057},null,{"$f":"Winter!D57/(3.7*(Temperaturen!$B$9/3600))","v":0},{"$f":"Winter!E57/(3.7*(Temperaturen!$B$9/3600))","v":0},{"$f":"Winter!F57/(3.7*(Temperaturen!$B$9/3600))","v":0},{"$f":"Winter!G57/(3.7*(Temperaturen!$B$9/3600))","v":0},{"$f":"Winter!H57/(3.7*(Temperaturen!$B$9/3600))","v":0},{"$f":"Winter!I57/(3.7*(Temperaturen!$B$9/3600))","v":0}]
[null,null,"Solar VL Temperatur (°C) > ",{"$f":"$B$2+$B$6+(D58/2)","v":61.611419505202704},61.581223573207993,61.729200053660421,61.577223389908134,62.48796637222835,61.652253977712917,null,{"$f":"Temperaturen!$B$2+Temperaturen!$B$6+(K58/2)","v":60.454659388715676},{"$f":"Temperaturen!$B$2+Temperaturen!$B$6+(L58/2)","v":60.388404210763809},{"$f":"Temperaturen!$B$2+Temperaturen!$B$6+(M58/2)","v":60.46582375544665},{"$f":"Temperaturen!$B$2+Temperaturen!$B$6+(N58/2)","v":60.371011758643057},{"$f":"Temperaturen!$B$2+Temperaturen!$B$6+(O58/2)","v":61.098505193698841},{"$f":"Temperaturen!$B$2+Temperaturen!$B$6+(P58/2)","v":60.613295308386604},null,{"$f":"Temperaturen!$B$2+Temperaturen!$B$6+(R58/2)","v":60},{"$f":"Temperaturen!$B$2+Temperaturen!$B$6+(S58/2)","v":60},{"$f":"Temperaturen!$B$2+Temperaturen!$B$6+(T58/2)","v":60},{"$f":"Temperaturen!$B$2+Temperaturen!$B$6+(U58/2)","v":60},{"$f":"Temperaturen!$B$2+Temperaturen!$B$6+(V58/2)","v":60},{"$f":"Temperaturen!$B$2+Temperaturen!$B$6+(W58/2)","v":60}]
[null,null,"Solar RL Temperatur (°C) > ",{"$f":"$B$2+$B$6-(D58/2)","v":58.388580494797296},58.418776426792007,58.270799946339579,58.422776610091866,57.51203362777165,58.347746022287083,null,{"$f":"Temperaturen!$B$2+Temperaturen!$B$6-(K58/2)","v":59.545340611284324},{"$f":"Temperaturen!$B$2+Temperaturen!$B$6-(L58/2)","v":59.611595789236191},{"$f":"Temperaturen!$B$2+Temperaturen!$B$6-(M58/2)","v":59.53417624455335},{"$f":"Temperaturen!$B$2+Temperaturen!$B$6-(N58/2)","v":59.628988241356943},{"$f":"Temperaturen!$B$2+Temperaturen!$B$6-(O58/2)","v":58.901494806301159},{"$f":"Temperaturen!$B$2+Temperaturen!$B$6-(P58/2)","v":59.386704691613396},null,{"$f":"Temperaturen!$B$2+Temperaturen!$B$6-(R58/2)","v":60},{"$f":"Temperaturen!$B$2+Temperaturen!$B$6-(S58/2)","v":60},{"$f":"Temperaturen!$B$2+Temperaturen!$B$6-(T58/2)","v":60},{"$f":"Temperaturen!$B$2+Temperaturen!$B$6-(U58/2)","v":60},{"$f":"Temperaturen!$B$2+Temperaturen!$B$6-(V58/2)","v":60},{"$f":"Temperaturen!$B$2+Temperaturen!$B$6-(W58/2)","v":60}]
["leicht wolkig Azimut > ",-60,"Diff. Solarkreis (K) > ",{"$f":"Sommer!D58/(3.7*($B$9/3600))","v":4.7480922372162171},{"$f":"Sommer!E58/(3.7*($B$9/3600))","v":4.4997813772032922},{"$f":"Sommer!F58/(3.7*($B$9/3600))","v":4.8296429040587618},{"$f":"Sommer!G58/(3.7*($B$9/3600))","v":4.4430971662894425},{"$f":"Sommer!H58/(3.7*($B$9/3600))","v":5.438228815250965},{"$f":"Sommer!I58/(3.7*($B$9/3600))","v":4.8451701565426104},null,{"$f":"Herbstfrühjahr!D58/(3.7*(Temperaturen!$B$9/3600))","v":2.7213346162897305},{"$f":"Herbstfrühjahr!E58/(3.7*(Temperaturen!$B$9/3600))","v":2.5078701303877797},{"$f":"Herbstfrühjahr!F58/(3.7*(Temperaturen!$B$9/3600))","v":2.7470870793709383},{"$f":"Herbstfrühjahr!G58/(3.7*(Temperaturen!$B$9/3600))","v":2.4517151302143523},{"$f":"Herbstfrühjahr!H58/(3.7*(Temperaturen!$B$9/3600))","v":3.5068015070270273},{"$f":"Herbstfrühjahr!I58/(3.7*(Temperaturen!$B$9/3600))","v":2.9653958465771115},null,{"$f":"Winter!D58/(3.7*(Temperaturen!$B$9/3600))","v":0},{"$f":"Winter!E58/(3.7*(Temperaturen!$B$9/3600))","v":0},{"$f":"Winter!F58/(3.7*(Temperaturen!$B$9/3600))","v":0},{"$f":"Winter!G58/(3.7*(Temperaturen!$B$9/3600))","v":0},{"$f":"Winter!H58/(3.7*(Temperaturen!$B$9/3600))","v":0},{"$f":"Winter!I58/(3.7*(Temperaturen!$B$9/3600))","v":0}]
[null,null,"Solar VL Temperatur (°C) > ",{"$f":"$B$2+$B$6+(D61/2)","v":62.374046118608106},62.249890688601646,62.414821452029379,62.221548583144724,62.719114407625483,62.422585078271304,null,{"$f":"Temperaturen!$B$2+Temperaturen!$B$6+(K61/2)","v":61.360667308144862},{"$f":"Temperaturen!$B$2+Temperaturen!$B$6+(L61/2)","v":61.253935065193893},{"$f":"Temperaturen!$B$2+Temperaturen!$B$6+(M61/2)","v":61.373543539685471},{"$f":"Temperaturen!$B$2+Temperaturen!$B$6+(N61/2)","v":61.225857565107177},{"$f":"Temperaturen!$B$2+Temperaturen!$B$6+(O61/2)","v":61.75340075351351},{"$f":"Temperaturen!$B$2+Temperaturen!$B$6+(P61/2)","v":61.482697923288555},null,{"$f":"Temperaturen!$B$2+Temperaturen!$B$6+(R61/2)","v":60},{"$f":"Temperaturen!$B$2+Temperaturen!$B$6+(S61/2)","v":60},{"$f":"Temperaturen!$B$2+Temperaturen!$B$6+(T61/2)","v":60},{"$f":"Temperaturen!$B$2+Temperaturen!$B$6+(U61/2)","v":60},{"$f":"Temperaturen!$B$2+Temperaturen!$B$6+(V61/2)","v":60},{"$f":"Temperaturen!$B$2+Temperaturen!$B$6+(W61/2)","v":60}]
[null,null,"Solar RL Temperatur (°C) > ",{"$f":"$B$2+$B$6-(D61/2)","v":57.625953881391894},57.750109311398354,57.585178547970621,57.778451416855276,57.280885592374517,57.577414921728696,null,{"$f":"Temperaturen!$B$2+Temperaturen!$B$6-(K61/2)","v":58.639332691855138},{"$f":"Temperaturen!$B$2+Temperaturen!$B$6-(L61/2)","v":58.746064934806107},{"$f":"Temperaturen!$B$2+Temperaturen!$B$6-(M61/2)","v":58.626456460314529},{"$f":"Temperaturen!$B$2+Temperaturen!$B$6-(N61/2)","v":58.774142434892823},{"$f":"Temperaturen!$B$2+Temperaturen!$B$6-(O61/2)","v":58.24659924648649},{"$f":"Temperaturen!$B$2+Temperaturen!$B$6-(P61/2)","v":58.517302076711445},null,{"$f":"Temperaturen!$B$2+Temperaturen!$B$6-(R61/2)","v":60},{"$f":"Temperaturen!$B$2+Temperaturen!$B$6-(S61/2)","v":60},{"$f":"Temperaturen!$B$2+Temperaturen!$B$6-(T61/2)","v":60},{"$f":"Temperaturen!$B$2+Temperaturen!$B$6-(U61/2)","v":60},{"$f":"Temperaturen!$B$2+Temperaturen!$B$6-(V61/2)","v":60},{"$f":"Temperaturen!$B$2+Temperaturen!$B$6-(W61/2)","v":60}]
["leicht wolkig Azimut > ",-50,"Diff. Solarkreis (K) > ",{"$f":"Sommer!D59/(3.7*($B$9/3600))","v":5.9167277508648644},{"$f":"Sommer!E59/(3.7*($B$9/3600))","v":5.3876283404935377},{"$f":"Sommer!F59/(3.7*($B$9/3600))","v":5.7649706568603447},{"$f":"Sommer!G59/(3.7*($B$9/3600))","v":5.3822528132072964},{"$f":"Sommer!H59/(3.7*($B$9/3600))","v":5.6336607291891898},{"$f":"Sommer!I59/(3.7*($B$9/3600))","v":5.5248210881572488},null,{"$f":"Herbstfrühjahr!D59/(3.7*(Temperaturen!$B$9/3600))","v":4.1983387879427028},{"$f":"Herbstfrühjahr!E59/(3.7*(Temperaturen!$B$9/3600))","v":3.7773682202773204},{"$f":"Herbstfrühjahr!F59/(3.7*(Temperaturen!$B$9/3600))","v":4.0824714244000377},{"$f":"Herbstfrühjahr!G59/(3.7*(Temperaturen!$B$9/3600))","v":3.7534677257781932},{"$f":"Herbstfrühjahr!H59/(3.7*(Temperaturen!$B$9/3600))","v":4.212399635027027},{"$f":"Herbstfrühjahr!I59/(3.7*(Temperaturen!$B$9/3600))","v":4.0321307970168387},null,{"$f":"Winter!D59/(3.7*(Temperaturen!$B$9/3600))","v":0},{"$f":"Winter!E59/(3.7*(Temperaturen!$B$9/3600))","v":0},{"$f":"Winter!F59/(3.7*(Temperaturen!$B$9/3600))","v":0},{"$f":"Winter!G59/(3.7*(Temperaturen!$B$9/3600))","v":0},{"$f":"Winter!H59/(3.7*(Temperaturen!$B$9/3600))","v":0.2778719354594596},{"$f":"Winter!I59/(3.7*(Temperaturen!$B$9/3600))","v":0}]
[null,null,"Solar VL Temperatur (°C) > ",{"$f":"$B$2+$B$6+(D64/2)","v":62.958363875432433},62.693814170246768,62.882485328430171,62.691126406603651,62.816830364594594,62.762410544078627,null,{"$f":"Temperaturen!$B$2+Temperaturen!$B$6+(K64/2)","v":62.099169393971351},{"$f":"Temperaturen!$B$2+Temperaturen!$B$6+(L64/2)","v":61.888684110138662},{"$f":"Temperaturen!$B$2+Temperaturen!$B$6+(M64/2)","v":62.04123571220002},{"$f":"Temperaturen!$B$2+Temperaturen!$B$6+(N64/2)","v":61.876733862889097},{"$f":"Temperaturen!$B$2+Temperaturen!$B$6+(O64/2)","v":62.106199817513513},{"$f":"Temperaturen!$B$2+Temperaturen!$B$6+(P64/2)","v":62.016065398508417},null,{"$f":"Temperaturen!$B$2+Temperaturen!$B$6+(R64/2)","v":60},{"$f":"Temperaturen!$B$2+Temperaturen!$B$6+(S64/2)","v":60},{"$f":"Temperaturen!$B$2+Temperaturen!$B$6+(T64/2)","v":60},{"$f":"Temperaturen!$B$2+Temperaturen!$B$6+(U64/2)","v":60},{"$f":"Temperaturen!$B$2+Temperaturen!$B$6+(V64/2)","v":60.138935967729729},{"$f":"Temperaturen!$B$2+Temperaturen!$B$6+(W64/2)","v":60}]
[null,null,"Solar RL Temperatur (°C) > ",{"$f":"$B$2+$B$6-(D64/2)","v":57.041636124567567},57.306185829753232,57.117514671569829,57.308873593396349,57.183169635405406,57.237589455921373,null,{"$f":"Temperaturen!$B$2+Temperaturen!$B$6-(K64/2)","v":57.900830606028649},{"$f":"Temperaturen!$B$2+Temperaturen!$B$6-(L64/2)","v":58.111315889861338},{"$f":"Temperaturen!$B$2+Temperaturen!$B$6-(M64/2)","v":57.95876428779998},{"$f":"Temperaturen!$B$2+Temperaturen!$B$6-(N64/2)","v":58.123266137110903},{"$f":"Temperaturen!$B$2+Temperaturen!$B$6-(O64/2)","v":57.893800182486487},{"$f":"Temperaturen!$B$2+Temperaturen!$B$6-(P64/2)","v":57.983934601491583},null,{"$f":"Temperaturen!$B$2+Temperaturen!$B$6-(R64/2)","v":60},{"$f":"Temperaturen!$B$2+Temperaturen!$B$6-(S64/2)","v":60},{"$f":"Temperaturen!$B$2+Temperaturen!$B$6-(T64/2)","v":60},{"$f":"Temperaturen!$B$2+Temperaturen!$B$6-(U64/2)","v":60},{"$f":"Temperaturen!$B$2+Temperaturen!$B$6-(V64/2)","v":59.861064032270271},{"$f":"Temperaturen!$B$2+Temperaturen!$B$6-(W64/2)","v":60}]
["leicht wolkig Azimut > ",-40,"Diff. Solarkreis (K) > ",{"$f":"Sommer!D60/(3.7*($B$9/3600))","v":6.5594899731891898},{"$f":"Sommer!E60/(3.7*($B$9/3600))","v":6.0537451333490013},{"$f":"Sommer!F60/(3.7*($B$9/3600))","v":6.4667090909595997},{"$f":"Sommer!G60/(3.7*($B$9/3600))","v":5.9877034046065774},{"$f":"Sommer!H60/(3.7*($B$9/3600))","v":6.2679293167015997},{"$f":"Sommer!I60/(3.7*($B$9/3600))","v":5.6852529349540939},null,{"$f":"Herbstfrühjahr!D60/(3.7*(Temperaturen!$B$9/3600))","v":5.1052664653491915},{"$f":"Herbstfrühjahr!E60/(3.7*(Temperaturen!$B$9/3600))","v":4.6796115261668643},{"$f":"Herbstfrühjahr!F60/(3.7*(Temperaturen!$B$9/3600))","v":5.0317494432876915},{"$f":"Herbstfrühjahr!G60/(3.7*(Temperaturen!$B$9/3600))","v":4.6109641082188801},{"$f":"Herbstfrühjahr!H60/(3.7*(Temperaturen!$B$9/3600))","v":5.0239001847633773},{"$f":"Herbstfrühjahr!I60/(3.7*(Temperaturen!$B$9/3600))","v":4.4935723820840554},null,{"$f":"Winter!D60/(3.7*(Temperaturen!$B$9/3600))","v":0.64129320070054097},{"$f":"Winter!E60/(3.7*(Temperaturen!$B$9/3600))","v":0.43404465940305553},{"$f":"Winter!F60/(3.7*(Temperaturen!$B$9/3600))","v":0.5854440048676901},{"$f":"Winter!G60/(3.7*(Temperaturen!$B$9/3600))","v":0.37527912446704864},{"$f":"Winter!H60/(3.7*(Temperaturen!$B$9/3600))","v":1.3926485574605627},{"$f":"Winter!I60/(3.7*(Temperaturen!$B$9/3600))","v":0.93222192419759498}]
[null,null,"Solar VL Temperatur (°C) > ",{"$f":"$B$2+$B$6+(D67/2)","v":63.279744986594594},63.026872566674498,63.233354545479799,62.993851702303289,63.133964658350799,62.842626467477047,null,{"$f":"Temperaturen!$B$2+Temperaturen!$B$6+(K67/2)","v":62.552633232674594},{"$f":"Temperaturen!$B$2+Temperaturen!$B$6+(L67/2)","v":62.339805763083433},{"$f":"Temperaturen!$B$2+Temperaturen!$B$6+(M67/2)","v":62.515874721643847},{"$f":"Temperaturen!$B$2+Temperaturen!$B$6+(N67/2)","v":62.30548205410944},{"$f":"Temperaturen!$B$2+Temperaturen!$B$6+(O67/2)","v":62.511950092381689},{"$f":"Temperaturen!$B$2+Temperaturen!$B$6+(P67/2)","v":62.246786191042027},null,{"$f":"Temperaturen!$B$2+Temperaturen!$B$6+(R67/2)","v":60.320646600350273},{"$f":"Temperaturen!$B$2+Temperaturen!$B$6+(S67/2)","v":60.217022329701528},{"$f":"Temperaturen!$B$2+Temperaturen!$B$6+(T67/2)","v":60.292722002433848},{"$f":"Temperaturen!$B$2+Temperaturen!$B$6+(U67/2)","v":60.187639562233521},{"$f":"Temperaturen!$B$2+Temperaturen!$B$6+(V67/2)","v":60.69632427873028},{"$f":"Temperaturen!$B$2+Temperaturen!$B$6+(W67/2)","v":60.466110962098796}]
[null,null,"Solar RL Temperatur (°C) > ",{"$f":"$B$2+$B$6-(D67/2)","v":56.720255013405406},56.973127433325502,56.766645454520201,57.006148297696711,56.866035341649201,57.157373532522953,null,{"$f":"Temperaturen!$B$2+Temperaturen!$B$6-(K67/2)","v":57.447366767325406},{"$f":"Temperaturen!$B$2+Temperaturen!$B$6-(L67/2)","v":57.660194236916567},{"$f":"Temperaturen!$B$2+Temperaturen!$B$6-(M67/2)","v":57.484125278356153},{"$f":"Temperaturen!$B$2+Temperaturen!$B$6-(N67/2)","v":57.69451794589056},{"$f":"Temperaturen!$B$2+Temperaturen!$B$6-(O67/2)","v":57.488049907618311},{"$f":"Temperaturen!$B$2+Temperaturen!$B$6-(P67/2)","v":57.753213808957973},null,{"$f":"Temperaturen!$B$2+Temperaturen!$B$6-(R67/2)","v":59.679353399649727},{"$f":"Temperaturen!$B$2+Temperaturen!$B$6-(S67/2)","v":59.782977670298472},{"$f":"Temperaturen!$B$2+Temperaturen!$B$6-(T67/2)","v":59.707277997566152},{"$f":"Temperaturen!$B$2+Temperaturen!$B$6-(U67/2)","v":59.812360437766479},{"$f":"Temperaturen!$B$2+Temperaturen!$B$6-(V67/2)","v":59.30367572126972},{"$f":"Temperaturen!$B$2+Temperaturen!$B$6-(W67/2)","v":59.533889037901204}]
["leicht wolkig Azimut > ",-30,"Diff. Solarkreis (K) > ",{"$f":"Sommer!D61/(3.7*($B$9/3600))","v":7.1036728584324331},{"$f":"Sommer!E61/(3.7*($B$9/3600))","v":6.4338694490246784},{"$f":"Sommer!F61/(3.7*($B$9/3600))","v":6.8662501463414625},{"$f":"Sommer!G61/(3.7*($B$9/3600))","v":6.3658409692451086},{"$f":"Sommer!H61/(3.7*($B$9/3600))","v":6.5252259313734147},{"$f":"Sommer!I61/(3.7*($B$9/3600))","v":5.2567867100607781},null,{"$f":"Herbstfrühjahr!D61/(3.7*(Temperaturen!$B$9/3600))","v":6.1370315887427038},{"$f":"Herbstfrühjahr!E61/(3.7*(Temperaturen!$B$9/3600))","v":5.5448352720470035},{"$f":"Herbstfrühjahr!F61/(3.7*(Temperaturen!$B$9/3600))","v":5.9395847380777846},{"$f":"Herbstfrühjahr!G61/(3.7*(Temperaturen!$B$9/3600))","v":5.4721220984007459},{"$f":"Herbstfrühjahr!H61/(3.7*(Temperaturen!$B$9/3600))","v":5.6855200510623298},{"$f":"Herbstfrühjahr!I61/(3.7*(Temperaturen!$B$9/3600))","v":4.5601462568845212},null,{"$f":"Winter!D61/(3.7*(Temperaturen!$B$9/3600))","v":2.2172870739636497},{"$f":"Winter!E61/(3.7*(Temperaturen!$B$9/3600))","v":1.8959214763243257},{"$f":"Winter!F61/(3.7*(Temperaturen!$B$9/3600))","v":2.1184198783427828},{"$f":"Winter!G61/(3.7*(Temperaturen!$B$9/3600))","v":1.8305597224082024},{"$f":"Winter!H61/(3.7*(Temperaturen!$B$9/3600))","v":2.5729048856194163},{"$f":"Winter!I61/(3.7*(Temperaturen!$B$9/3600))","v":1.8683452335467481}]
[null,null,"Solar VL Temperatur (°C) > ",{"$f":"$B$2+$B$6+(D70/2)","v":63.551836429216216},63.216934724512342,63.433125073170729,63.182920484622557,63.262612965686706,62.62839335503039,null,{"$f":"Temperaturen!$B$2+Temperaturen!$B$6+(K70/2)","v":63.068515794371351},{"$f":"Temperaturen!$B$2+Temperaturen!$B$6+(L70/2)","v":62.772417636023505},{"$f":"Temperaturen!$B$2+Temperaturen!$B$6+(M70/2)","v":62.969792369038892},{"$f":"Temperaturen!$B$2+Temperaturen!$B$6+(N70/2)","v":62.736061049200373},{"$f":"Temperaturen!$B$2+Temperaturen!$B$6+(O70/2)","v":62.842760025531163},{"$f":"Temperaturen!$B$2+Temperaturen!$B$6+(P70/2)","v":62.280073128442261},null,{"$f":"Temperaturen!$B$2+Temperaturen!$B$6+(R70/2)","v":61.108643536981823},{"$f":"Temperaturen!$B$2+Temperaturen!$B$6+(S70/2)","v":60.947960738162166},{"$f":"Temperaturen!$B$2+Temperaturen!$B$6+(T70/2)","v":61.059209939171389},{"$f":"Temperaturen!$B$2+Temperaturen!$B$6+(U70/2)","v":60.915279861204098},{"$f":"Temperaturen!$B$2+Temperaturen!$B$6+(V70/2)","v":61.286452442809711},{"$f":"Temperaturen!$B$2+Temperaturen!$B$6+(W70/2)","v":60.934172616773374}]
[null,null,"Solar RL Temperatur (°C) > ",{"$f":"$B$2+$B$6-(D70/2)","v":56.448163570783784},56.783065275487658,56.566874926829271,56.817079515377443,56.737387034313294,57.37160664496961,null,{"$f":"Temperaturen!$B$2+Temperaturen!$B$6-(K70/2)","v":56.931484205628649},{"$f":"Temperaturen!$B$2+Temperaturen!$B$6-(L70/2)","v":57.227582363976495},{"$f":"Temperaturen!$B$2+Temperaturen!$B$6-(M70/2)","v":57.030207630961108},{"$f":"Temperaturen!$B$2+Temperaturen!$B$6-(N70/2)","v":57.263938950799627},{"$f":"Temperaturen!$B$2+Temperaturen!$B$6-(O70/2)","v":57.157239974468837},{"$f":"Temperaturen!$B$2+Temperaturen!$B$6-(P70/2)","v":57.719926871557739},null,{"$f":"Temperaturen!$B$2+Temperaturen!$B$6-(R70/2)","v":58.891356463018177},{"$f":"Temperaturen!$B$2+Temperaturen!$B$6-(S70/2)","v":59.052039261837834},{"$f":"Temperaturen!$B$2+Temperaturen!$B$6-(T70/2)","v":58.940790060828611},{"$f":"Temperaturen!$B$2+Temperaturen!$B$6-(U70/2)","v":59.084720138795902},{"$f":"Temperaturen!$B$2+Temperaturen!$B$6-(V70/2)","v":58.713547557190289},{"$f":"Temperaturen!$B$2+Temperaturen!$B$6-(W70/2)","v":59.065827383226626}]
["leicht wolkig Azimut > ",-20,"Diff. Solarkreis (K) > ",{"$f":"Sommer!D62/(3.7*($B$9/3600))","v":7.390791462162162},{"$f":"Sommer!E62/(3.7*($B$9/3600))","v":6.7012652999294957},{"$f":"Sommer!F62/(3.7*($B$9/3600))","v":7.1476840300630933},{"$f":"Sommer!G62/(3.7*($B$9/3600))","v":6.6317134191452549},{"$f":"Sommer!H62/(3.7*($B$9/3600))","v":6.621396847396583},{"$f":"Sommer!I62/(3.7*($B$9/3600))","v":4.8832992986070094},null,{"$f":"Herbstfrühjahr!D62/(3.7*(Temperaturen!$B$9/3600))","v":6.8157469405945958},{"$f":"Herbstfrühjahr!E62/(3.7*(Temperaturen!$B$9/3600))","v":6.1791370272338435},{"$f":"Herbstfrühjahr!F62/(3.7*(Temperaturen!$B$9/3600))","v":6.6054798693929753},{"$f":"Herbstfrühjahr!G62/(3.7*(Temperaturen!$B$9/3600))","v":6.1033072611029171},{"$f":"Herbstfrühjahr!H62/(3.7*(Temperaturen!$B$9/3600))","v":6.0883730363199113},{"$f":"Herbstfrühjahr!I62/(3.7*(Temperaturen!$B$9/3600))","v":4.4943286679214793},null,{"$f":"Winter!D62/(3.7*(Temperaturen!$B$9/3600))","v":3.2533646687027034},{"$f":"Winter!E62/(3.7*(Temperaturen!$B$9/3600))","v":2.8648405145569922},{"$f":"Winter!F62/(3.7*(Temperaturen!$B$9/3600))","v":3.1349170691074488},{"$f":"Winter!G62/(3.7*(Temperaturen!$B$9/3600))","v":2.7949087557427781},{"$f":"Winter!H62/(3.7*(Temperaturen!$B$9/3600))","v":3.3014476974903486},{"$f":"Winter!I62/(3.7*(Temperaturen!$B$9/3600))","v":2.2983934106740471}]
[null,null,"Solar VL Temperatur (°C) > ",{"$f":"$B$2+$B$6+(D73/2)","v":63.695395731081078},63.350632649964751,63.573842015031545,63.315856709572628,63.310698423698291,62.441649649303507,null,{"$f":"Temperaturen!$B$2+Temperaturen!$B$6+(K73/2)","v":63.407873470297297},{"$f":"Temperaturen!$B$2+Temperaturen!$B$6+(L73/2)","v":63.089568513616925},{"$f":"Temperaturen!$B$2+Temperaturen!$B$6+(M73/2)","v":63.30273993469649},{"$f":"Temperaturen!$B$2+Temperaturen!$B$6+(N73/2)","v":63.051653630551456},{"$f":"Temperaturen!$B$2+Temperaturen!$B$6+(O73/2)","v":63.044186518159954},{"$f":"Temperaturen!$B$2+Temperaturen!$B$6+(P73/2)","v":62.24716433396074},null,{"$f":"Temperaturen!$B$2+Temperaturen!$B$6+(R73/2)","v":61.626682334351351},{"$f":"Temperaturen!$B$2+Temperaturen!$B$6+(S73/2)","v":61.432420257278494},{"$f":"Temperaturen!$B$2+Temperaturen!$B$6+(T73/2)","v":61.567458534553722},{"$f":"Temperaturen!$B$2+Temperaturen!$B$6+(U73/2)","v":61.397454377871391},{"$f":"Temperaturen!$B$2+Temperaturen!$B$6+(V73/2)","v":61.650723848745173},{"$f":"Temperaturen!$B$2+Temperaturen!$B$6+(W73/2)","v":61.149196705337026}]
[null,null,"Solar RL Temperatur (°C) > ",{"$f":"$B$2+$B$6-(D73/2)","v":56.304604268918922},56.649367350035249,56.426157984968455,56.684143290427372,56.689301576301709,57.558350350696493,null,{"$f":"Temperaturen!$B$2+Temperaturen!$B$6-(K73/2)","v":56.592126529702703},{"$f":"Temperaturen!$B$2+Temperaturen!$B$6-(L73/2)","v":56.910431486383075},{"$f":"Temperaturen!$B$2+Temperaturen!$B$6-(M73/2)","v":56.69726006530351},{"$f":"Temperaturen!$B$2+Temperaturen!$B$6-(N73/2)","v":56.948346369448544},{"$f":"Temperaturen!$B$2+Temperaturen!$B$6-(O73/2)","v":56.955813481840046},{"$f":"Temperaturen!$B$2+Temperaturen!$B$6-(P73/2)","v":57.75283566603926},null,{"$f":"Temperaturen!$B$2+Temperaturen!$B$6-(R73/2)","v":58.373317665648649},{"$f":"Temperaturen!$B$2+Temperaturen!$B$6-(S73/2)","v":58.567579742721506},{"$f":"Temperaturen!$B$2+Temperaturen!$B$6-(T73/2)","v":58.432541465446278},{"$f":"Temperaturen!$B$2+Temperaturen!$B$6-(U73/2)","v":58.602545622128609},{"$f":"Temperaturen!$B$2+Temperaturen!$B$6-(V73/2)","v":58.349276151254827},{"$f":"Temperaturen!$B$2+Temperaturen!$B$6-(W73/2)","v":58.850803294662974}]
["leicht wolkig Azimut > ",-10,"Diff. Solarkreis (K) > ",{"$f":"Sommer!D63/(3.7*($B$9/3600))","v":7.5180522040540545},{"$f":"Sommer!E63/(3.7*($B$9/3600))","v":6.8893714500587562},{"$f":"Sommer!F63/(3.7*($B$9/3600))","v":7.3460449976457278},{"$f":"Sommer!G63/(3.7*($B$9/3600))","v":6.8186220742910404},{"$f":"Sommer!H63/(3.7*($B$9/3600))","v":6.7160272269663563},{"$f":"Sommer!I63/(3.7*($B$9/3600))","v":4.7689662682012166},null,{"$f":"Herbstfrühjahr!D63/(3.7*(Temperaturen!$B$9/3600))","v":7.1485827270810818},{"$f":"Herbstfrühjahr!E63/(3.7*(Temperaturen!$B$9/3600))","v":6.5564882801410116},{"$f":"Herbstfrühjahr!F63/(3.7*(Temperaturen!$B$9/3600))","v":7.002164405650249},{"$f":"Herbstfrühjahr!G63/(3.7*(Temperaturen!$B$9/3600))","v":6.4785980702436463},{"$f":"Herbstfrühjahr!H63/(3.7*(Temperaturen!$B$9/3600))","v":6.3358678751947046},{"$f":"Herbstfrühjahr!I63/(3.7*(Temperaturen!$B$9/3600))","v":4.5136644803207036},null,{"$f":"Winter!D63/(3.7*(Temperaturen!$B$9/3600))","v":4.0345498381621638},{"$f":"Winter!E63/(3.7*(Temperaturen!$B$9/3600))","v":3.6329509753231495},{"$f":"Winter!F63/(3.7*(Temperaturen!$B$9/3600))","v":3.9410243359261696},{"$f":"Winter!G63/(3.7*(Temperaturen!$B$9/3600))","v":3.5592745990680341},{"$f":"Winter!H63/(3.7*(Temperaturen!$B$9/3600))","v":3.8823326428494216},{"$f":"Winter!I63/(3.7*(Temperaturen!$B$9/3600))","v":2.6610857130531498}]
[null,null,"Solar VL Temperatur (°C) > ",{"$f":"$B$2+$B$6+(D76/2)","v":63.759026102027029},63.44468572502938,63.673022498822867,63.409311037145521,63.35801361348318,62.384483134100606,null,{"$f":"Temperaturen!$B$2+Temperaturen!$B$6+(K76/2)","v":63.574291363540539},{"$f":"Temperaturen!$B$2+Temperaturen!$B$6+(L76/2)","v":63.278244140070505},{"$f":"Temperaturen!$B$2+Temperaturen!$B$6+(M76/2)","v":63.501082202825124},{"$f":"Temperaturen!$B$2+Temperaturen!$B$6+(N76/2)","v":63.239299035121824},{"$f":"Temperaturen!$B$2+Temperaturen!$B$6+(O76/2)","v":63.167933937597354},{"$f":"Temperaturen!$B$2+Temperaturen!$B$6+(P76/2)","v":62.25683224016035},null,{"$f":"Temperaturen!$B$2+Temperaturen!$B$6+(R76/2)","v":62.017274919081082},{"$f":"Temperaturen!$B$2+Temperaturen!$B$6+(S76/2)","v":61.816475487661577},{"$f":"Temperaturen!$B$2+Temperaturen!$B$6+(T76/2)","v":61.970512167963086},{"$f":"Temperaturen!$B$2+Temperaturen!$B$6+(U76/2)","v":61.779637299534016},{"$f":"Temperaturen!$B$2+Temperaturen!$B$6+(V76/2)","v":61.94116632142471},{"$f":"Temperaturen!$B$2+Temperaturen!$B$6+(W76/2)","v":61.330542856526577}]
[null,null,"Solar RL Temperatur (°C) > ",{"$f":"$B$2+$B$6-(D76/2)","v":56.240973897972971},56.55531427497062,56.326977501177133,56.590688962854479,56.64198638651682,57.615516865899394,null,{"$f":"Temperaturen!$B$2+Temperaturen!$B$6-(K76/2)","v":56.425708636459461},{"$f":"Temperaturen!$B$2+Temperaturen!$B$6-(L76/2)","v":56.721755859929495},{"$f":"Temperaturen!$B$2+Temperaturen!$B$6-(M76/2)","v":56.498917797174876},{"$f":"Temperaturen!$B$2+Temperaturen!$B$6-(N76/2)","v":56.760700964878176},{"$f":"Temperaturen!$B$2+Temperaturen!$B$6-(O76/2)","v":56.832066062402646},{"$f":"Temperaturen!$B$2+Temperaturen!$B$6-(P76/2)","v":57.74316775983965},null,{"$f":"Temperaturen!$B$2+Temperaturen!$B$6-(R76/2)","v":57.982725080918918},{"$f":"Temperaturen!$B$2+Temperaturen!$B$6-(S76/2)","v":58.183524512338423},{"$f":"Temperaturen!$B$2+Temperaturen!$B$6-(T76/2)","v":58.029487832036914},{"$f":"Temperaturen!$B$2+Temperaturen!$B$6-(U76/2)","v":58.220362700465984},{"$f":"Temperaturen!$B$2+Temperaturen!$B$6-(V76/2)","v":58.05883367857529},{"$f":"Temperaturen!$B$2+Temperaturen!$B$6-(W76/2)","v":58.669457143473423}]
["leicht wolkig Azimut > ",0,"Diff. Solarkreis (K) > ",{"$f":"Sommer!D64/(3.7*($B$9/3600))","v":7.5474200675675682},{"$f":"Sommer!E64/(3.7*($B$9/3600))","v":6.9171598965922438},{"$f":"Sommer!F64/(3.7*($B$9/3600))","v":7.3751593374140674},{"$f":"Sommer!G64/(3.7*($B$9/3600))","v":6.8462963014245766},{"$f":"Sommer!H64/(3.7*($B$9/3600))","v":6.6711534721456163},{"$f":"Sommer!I64/(3.7*($B$9/3600))","v":4.7859246159058584},null,{"$f":"Herbstfrühjahr!D64/(3.7*(Temperaturen!$B$9/3600))","v":7.2562648932972991},{"$f":"Herbstfrühjahr!E64/(3.7*(Temperaturen!$B$9/3600))","v":6.6583792507638062},{"$f":"Herbstfrühjahr!F64/(3.7*(Temperaturen!$B$9/3600))","v":7.1089169848008291},{"$f":"Herbstfrühjahr!G64/(3.7*(Temperaturen!$B$9/3600))","v":6.5800702363999486},{"$f":"Herbstfrühjahr!H64/(3.7*(Temperaturen!$B$9/3600))","v":6.3524155790402652},{"$f":"Herbstfrühjahr!I64/(3.7*(Temperaturen!$B$9/3600))","v":4.5758450885710609},null,{"$f":"Winter!D64/(3.7*(Temperaturen!$B$9/3600))","v":4.183347013297297},{"$f":"Winter!E64/(3.7*(Temperaturen!$B$9/3600))","v":3.7737457710928322},{"$f":"Winter!F64/(3.7*(Temperaturen!$B$9/3600))","v":4.0885369907524236},{"$f":"Winter!G64/(3.7*(Temperaturen!$B$9/3600))","v":3.6994906832112906},{"$f":"Winter!H64/(3.7*(Temperaturen!$B$9/3600))","v":3.953442964699394},{"$f":"Winter!I64/(3.7*(Temperaturen!$B$9/3600))","v":2.7470080080900039}]
[null,null,"Solar VL Temperatur (°C) > ",{"$f":"$B$2+$B$6+(D79/2)","v":63.773710033783786},63.458579948296119,63.687579668707031,63.423148150712287,63.335576736072809,62.392962307952928,null,{"$f":"Temperaturen!$B$2+Temperaturen!$B$6+(K79/2)","v":63.62813244664865},{"$f":"Temperaturen!$B$2+Temperaturen!$B$6+(L79/2)","v":63.3291896253819},{"$f":"Temperaturen!$B$2+Temperaturen!$B$6+(M79/2)","v":63.554458492400414},{"$f":"Temperaturen!$B$2+Temperaturen!$B$6+(N79/2)","v":63.290035118199974},{"$f":"Temperaturen!$B$2+Temperaturen!$B$6+(O79/2)","v":63.176207789520134},{"$f":"Temperaturen!$B$2+Temperaturen!$B$6+(P79/2)","v":62.287922544285529},null,{"$f":"Temperaturen!$B$2+Temperaturen!$B$6+(R79/2)","v":62.091673506648647},{"$f":"Temperaturen!$B$2+Temperaturen!$B$6+(S79/2)","v":61.886872885546417},{"$f":"Temperaturen!$B$2+Temperaturen!$B$6+(T79/2)","v":62.044268495376215},{"$f":"Temperaturen!$B$2+Temperaturen!$B$6+(U79/2)","v":61.849745341605647},{"$f":"Temperaturen!$B$2+Temperaturen!$B$6+(V79/2)","v":61.976721482349696},{"$f":"Temperaturen!$B$2+Temperaturen!$B$6+(W79/2)","v":61.373504004045003}]
[null,null,"Solar RL Temperatur (°C) > ",{"$f":"$B$2+$B$6-(D79/2)","v":56.226289966216214},56.541420051703881,56.312420331292969,56.576851849287713,56.664423263927191,57.607037692047072,null,{"$f":"Temperaturen!$B$2+Temperaturen!$B$6-(K79/2)","v":56.37186755335135},{"$f":"Temperaturen!$B$2+Temperaturen!$B$6-(L79/2)","v":56.6708103746181},{"$f":"Temperaturen!$B$2+Temperaturen!$B$6-(M79/2)","v":56.445541507599586},{"$f":"Temperaturen!$B$2+Temperaturen!$B$6-(N79/2)","v":56.709964881800026},{"$f":"Temperaturen!$B$2+Temperaturen!$B$6-(O79/2)","v":56.823792210479866},{"$f":"Temperaturen!$B$2+Temperaturen!$B$6-(P79/2)","v":57.712077455714471},null,{"$f":"Temperaturen!$B$2+Temperaturen!$B$6-(R79/2)","v":57.908326493351353},{"$f":"Temperaturen!$B$2+Temperaturen!$B$6-(S79/2)","v":58.113127114453583},{"$f":"Temperaturen!$B$2+Temperaturen!$B$6-(T79/2)","v":57.955731504623785},{"$f":"Temperaturen!$B$2+Temperaturen!$B$6-(U79/2)","v":58.150254658394353},{"$f":"Temperaturen!$B$2+Temperaturen!$B$6-(V79/2)","v":58.023278517650304},{"$f":"Temperaturen!$B$2+Temperaturen!$B$6-(W79/2)","v":58.626495995954997}]
["leicht wolkig Azimut > ",10,"Diff. Solarkreis (K) > ",{"$f":"Sommer!D65/(3.7*($B$9/3600))","v":7.5180522040540545},{"$f":"Sommer!E65/(3.7*($B$9/3600))","v":6.8893714500587562},{"$f":"Sommer!F65/(3.7*($B$9/3600))","v":7.3460449976457278},{"$f":"Sommer!G65/(3.7*($B$9/3600))","v":6.8186220742910404},{"$f":"Sommer!H65/(3.7*($B$9/3600))","v":6.7160272269663563},{"$f":"Sommer!I65/(3.7*($B$9/3600))","v":4.7689662682012166},null,{"$f":"Herbstfrühjahr!D65/(3.7*(Temperaturen!$B$9/3600))","v":7.1485827270810818},{"$f":"Herbstfrühjahr!E65/(3.7*(Temperaturen!$B$9/3600))","v":6.5564882801410116},{"$f":"Herbstfrühjahr!F65/(3.7*(Temperaturen!$B$9/3600))","v":7.002164405650249},{"$f":"Herbstfrühjahr!G65/(3.7*(Temperaturen!$B$9/3600))","v":6.4785980702436463},{"$f":"Herbstfrühjahr!H65/(3.7*(Temperaturen!$B$9/3600))","v":6.3358678751947046},{"$f":"Herbstfrühjahr!I65/(3.7*(Temperaturen!$B$9/3600))","v":4.5136644803207036},null,{"$f":"Winter!D65/(3.7*(Temperaturen!$B$9/3600))","v":4.0345498381621638},{"$f":"Winter!E65/(3.7*(Temperaturen!$B$9/3600))","v":3.6329509753231495},{"$f":"Winter!F65/(3.7*(Temperaturen!$B$9/3600))","v":3.9410243359261696},{"$f":"Winter!G65/(3.7*(Temperaturen!$B$9/3600))","v":3.5592745990680341},{"$f":"Winter!H65/(3.7*(Temperaturen!$B$9/3600))","v":3.8823326428494216},{"$f":"Winter!I65/(3.7*(Temperaturen!$B$9/3600))","v":2.6610857130531498}]
[null,null,"Solar VL Temperatur (°C) > ",{"$f":"$B$2+$B$6+(D82/2)","v":63.759026102027029},63.44468572502938,63.673022498822867,63.409311037145521,63.35801361348318,62.384483134100606,null,{"$f":"Temperaturen!$B$2+Temperaturen!$B$6+(K82/2)","v":63.574291363540539},{"$f":"Temperaturen!$B$2+Temperaturen!$B$6+(L82/2)","v":63.278244140070505},{"$f":"Temperaturen!$B$2+Temperaturen!$B$6+(M82/2)","v":63.501082202825124},{"$f":"Temperaturen!$B$2+Temperaturen!$B$6+(N82/2)","v":63.239299035121824},{"$f":"Temperaturen!$B$2+Temperaturen!$B$6+(O82/2)","v":63.167933937597354},{"$f":"Temperaturen!$B$2+Temperaturen!$B$6+(P82/2)","v":62.25683224016035},null,{"$f":"Temperaturen!$B$2+Temperaturen!$B$6+(R82/2)","v":62.017274919081082},{"$f":"Temperaturen!$B$2+Temperaturen!$B$6+(S82/2)","v":61.816475487661577},{"$f":"Temperaturen!$B$2+Temperaturen!$B$6+(T82/2)","v":61.970512167963086},{"$f":"Temperaturen!$B$2+Temperaturen!$B$6+(U82/2)","v":61.779637299534016},{"$f":"Temperaturen!$B$2+Temperaturen!$B$6+(V82/2)","v":61.94116632142471},{"$f":"Temperaturen!$B$2+Temperaturen!$B$6+(W82/2)","v":61.330542856526577}]
[null,null,"Solar RL Temperatur (°C) > ",{"$f":"$B$2+$B$6-(D82/2)","v":56.240973897972971},56.55531427497062,56.326977501177133,56.590688962854479,56.64198638651682,57.615516865899394,null,{"$f":"Temperaturen!$B$2+Temperaturen!$B$6-(K82/2)","v":56.425708636459461},{"$f":"Temperaturen!$B$2+Temperaturen!$B$6-(L82/2)","v":56.721755859929495},{"$f":"Temperaturen!$B$2+Temperaturen!$B$6-(M82/2)","v":56.498917797174876},{"$f":"Temperaturen!$B$2+Temperaturen!$B$6-(N82/2)","v":56.760700964878176},{"$f":"Temperaturen!$B$2+Temperaturen!$B$6-(O82/2)","v":56.832066062402646},{"$f":"Temperaturen!$B$2+Temperaturen!$B$6-(P82/2)","v":57.74316775983965},null,{"$f":"Temperaturen!$B$2+Temperaturen!$B$6-(R82/2)","v":57.982725080918918},{"$f":"Temperaturen!$B$2+Temperaturen!$B$6-(S82/2)","v":58.183524512338423},{"$f":"Temperaturen!$B$2+Temperaturen!$B$6-(T82/2)","v":58.029487832036914},{"$f":"Temperaturen!$B$2+Temperaturen!$B$6-(U82/2)","v":58.220362700465984},{"$f":"Temperaturen!$B$2+Temperaturen!$B$6-(V82/2)","v":58.05883367857529},{"$f":"Temperaturen!$B$2+Temperaturen!$B$6-(W82/2)","v":58.669457143473423}]
["leicht wolkig Azimut > ",20,"Diff. Solarkreis (K) > ",{"$f":"Sommer!D66/(3.7*($B$9/3600))","v":7.390791462162162},{"$f":"Sommer!E66/(3.7*($B$9/3600))","v":6.7012652999294957},{"$f":"Sommer!F66/(3.7*($B$9/3600))","v":7.1476840300630933},{"$f":"Sommer!G66/(3.7*($B$9/3600))","v":6.6317134191452549},{"$f":"Sommer!H66/(3.7*($B$9/3600))","v":6.621396847396583},{"$f":"Sommer!I66/(3.7*($B$9/3600))","v":4.8832992986070094},null,{"$f":"Herbstfrühjahr!D66/(3.7*(Temperaturen!$B$9/3600))","v":6.8157469405945958},{"$f":"Herbstfrühjahr!E66/(3.7*(Temperaturen!$B$9/3600))","v":6.1791370272338435},{"$f":"Herbstfrühjahr!F66/(3.7*(Temperaturen!$B$9/3600))","v":6.6054798693929753},{"$f":"Herbstfrühjahr!G66/(3.7*(Temperaturen!$B$9/3600))","v":6.1033072611029171},{"$f":"Herbstfrühjahr!H66/(3.7*(Temperaturen!$B$9/3600))","v":6.0883730363199113},{"$f":"Herbstfrühjahr!I66/(3.7*(Temperaturen!$B$9/3600))","v":4.4943286679214793},null,{"$f":"Winter!D66/(3.7*(Temperaturen!$B$9/3600))","v":3.2533646687027034},{"$f":"Winter!E66/(3.7*(Temperaturen!$B$9/3600))","v":2.8648405145569922},{"$f":"Winter!F66/(3.7*(Temperaturen!$B$9/3600))","v":3.1349170691074488},{"$f":"Winter!G66/(3.7*(Temperaturen!$B$9/3600))","v":2.7949087557427781},{"$f":"Winter!H66/(3.7*(Temperaturen!$B$9/3600))","v":3.3014476974903486},{"$f":"Winter!I66/(3.7*(Temperaturen!$B$9/3600))","v":2.2983934106740471}]
[null,null,"Solar VL Temperatur (°C) > ",{"$f":"$B$2+$B$6+(D85/2)","v":63.695395731081078},63.350632649964751,63.573842015031545,63.315856709572628,63.310698423698291,62.441649649303507,null,{"$f":"Temperaturen!$B$2+Temperaturen!$B$6+(K85/2)","v":63.407873470297297},{"$f":"Temperaturen!$B$2+Temperaturen!$B$6+(L85/2)","v":63.089568513616925},{"$f":"Temperaturen!$B$2+Temperaturen!$B$6+(M85/2)","v":63.30273993469649},{"$f":"Temperaturen!$B$2+Temperaturen!$B$6+(N85/2)","v":63.051653630551456},{"$f":"Temperaturen!$B$2+Temperaturen!$B$6+(O85/2)","v":63.044186518159954},{"$f":"Temperaturen!$B$2+Temperaturen!$B$6+(P85/2)","v":62.24716433396074},null,{"$f":"Temperaturen!$B$2+Temperaturen!$B$6+(R85/2)","v":61.626682334351351},{"$f":"Temperaturen!$B$2+Temperaturen!$B$6+(S85/2)","v":61.432420257278494},{"$f":"Temperaturen!$B$2+Temperaturen!$B$6+(T85/2)","v":61.567458534553722},{"$f":"Temperaturen!$B$2+Temperaturen!$B$6+(U85/2)","v":61.397454377871391},{"$f":"Temperaturen!$B$2+Temperaturen!$B$6+(V85/2)","v":61.650723848745173},{"$f":"Temperaturen!$B$2+Temperaturen!$B$6+(W85/2)","v":61.149196705337026}]
[null,null,"Solar RL Temperatur (°C) > ",{"$f":"$B$2+$B$6-(D85/2)","v":56.304604268918922},56.649367350035249,56.426157984968455,56.684143290427372,56.689301576301709,57.558350350696493,null,{"$f":"Temperaturen!$B$2+Temperaturen!$B$6-(K85/2)","v":56.592126529702703},{"$f":"Temperaturen!$B$2+Temperaturen!$B$6-(L85/2)","v":56.910431486383075},{"$f":"Temperaturen!$B$2+Temperaturen!$B$6-(M85/2)","v":56.69726006530351},{"$f":"Temperaturen!$B$2+Temperaturen!$B$6-(N85/2)","v":56.948346369448544},{"$f":"Temperaturen!$B$2+Temperaturen!$B$6-(O85/2)","v":56.955813481840046},{"$f":"Temperaturen!$B$2+Temperaturen!$B$6-(P85/2)","v":57.75283566603926},null,{"$f":"Temperaturen!$B$2+Temperaturen!$B$6-(R85/2)","v":58.373317665648649},{"$f":"Temperaturen!$B$2+Temperaturen!$B$6-(S85/2)","v":58.567579742721506},{"$f":"Temperaturen!$B$2+Temperaturen!$B$6-(T85/2)","v":58.432541465446278},{"$f":"Temperaturen!$B$2+Temperaturen!$B$6-(U85/2)","v":58.602545622128609},{"$f":"Temperaturen!$B$2+Temperaturen!$B$6-(V85/2)","v":58.349276151254827},{"$f":"Temperaturen!$B$2+Temperaturen!$B$6-(W85/2)","v":58.850803294662974}]
["leicht wolkig Azimut > ",30,"Diff. Solarkreis (K) > ",{"$f":"Sommer!D67/(3.7*($B$9/3600))","v":7.1036728584324331},{"$f":"Sommer!E67/(3.7*($B$9/3600))","v":6.4338694490246784},{"$f":"Sommer!F67/(3.7*($B$9/3600))","v":6.8662501463414625},{"$f":"Sommer!G67/(3.7*($B$9/3600))","v":6.3658409692451086},{"$f":"Sommer!H67/(3.7*($B$9/3600))","v":6.5252259313734147},{"$f":"Sommer!I67/(3.7*($B$9/3600))","v":5.2567867100607781},null,{"$f":"Herbstfrühjahr!D67/(3.7*(Temperaturen!$B$9/3600))","v":6.1370315887427038},{"$f":"Herbstfrühjahr!E67/(3.7*(Temperaturen!$B$9/3600))","v":5.5448352720470035},{"$f":"Herbstfrühjahr!F67/(3.7*(Temperaturen!$B$9/3600))","v":5.9395847380777846},{"$f":"Herbstfrühjahr!G67/(3.7*(Temperaturen!$B$9/3600))","v":5.4721220984007459},{"$f":"Herbstfrühjahr!H67/(3.7*(Temperaturen!$B$9/3600))","v":5.6855200510623298},{"$f":"Herbstfrühjahr!I67/(3.7*(Temperaturen!$B$9/3600))","v":4.5601462568845212},null,{"$f":"Winter!D67/(3.7*(Temperaturen!$B$9/3600))","v":2.2172870739636497},{"$f":"Winter!E67/(3.7*(Temperaturen!$B$9/3600))","v":1.8959214763243257},{"$f":"Winter!F67/(3.7*(Temperaturen!$B$9/3600))","v":2.1184198783427828},{"$f":"Winter!G67/(3.7*(Temperaturen!$B$9/3600))","v":1.8305597224082024},{"$f":"Winter!H67/(3.7*(Temperaturen!$B$9/3600))","v":2.5729048856194163},{"$f":"Winter!I67/(3.7*(Temperaturen!$B$9/3600))","v":1.8683452335467481}]
[null,null,"Solar VL Temperatur (°C) > ",{"$f":"$B$2+$B$6+(D88/2)","v":63.551836429216216},63.216934724512342,63.433125073170729,63.182920484622557,63.262612965686706,62.62839335503039,null,{"$f":"Temperaturen!$B$2+Temperaturen!$B$6+(K88/2)","v":63.068515794371351},{"$f":"Temperaturen!$B$2+Temperaturen!$B$6+(L88/2)","v":62.772417636023505},{"$f":"Temperaturen!$B$2+Temperaturen!$B$6+(M88/2)","v":62.969792369038892},{"$f":"Temperaturen!$B$2+Temperaturen!$B$6+(N88/2)","v":62.736061049200373},{"$f":"Temperaturen!$B$2+Temperaturen!$B$6+(O88/2)","v":62.842760025531163},{"$f":"Temperaturen!$B$2+Temperaturen!$B$6+(P88/2)","v":62.280073128442261},null,{"$f":"Temperaturen!$B$2+Temperaturen!$B$6+(R88/2)","v":61.108643536981823},{"$f":"Temperaturen!$B$2+Temperaturen!$B$6+(S88/2)","v":60.947960738162166},{"$f":"Temperaturen!$B$2+Temperaturen!$B$6+(T88/2)","v":61.059209939171389},{"$f":"Temperaturen!$B$2+Temperaturen!$B$6+(U88/2)","v":60.915279861204098},{"$f":"Temperaturen!$B$2+Temperaturen!$B$6+(V88/2)","v":61.286452442809711},{"$f":"Temperaturen!$B$2+Temperaturen!$B$6+(W88/2)","v":60.934172616773374}]
[null,null,"Solar RL Temperatur (°C) > ",{"$f":"$B$2+$B$6-(D88/2)","v":56.448163570783784},56.783065275487658,56.566874926829271,56.817079515377443,56.737387034313294,57.37160664496961,null,{"$f":"Temperaturen!$B$2+Temperaturen!$B$6-(K88/2)","v":56.931484205628649},{"$f":"Temperaturen!$B$2+Temperaturen!$B$6-(L88/2)","v":57.227582363976495},{"$f":"Temperaturen!$B$2+Temperaturen!$B$6-(M88/2)","v":57.030207630961108},{"$f":"Temperaturen!$B$2+Temperaturen!$B$6-(N88/2)","v":57.263938950799627},{"$f":"Temperaturen!$B$2+Temperaturen!$B$6-(O88/2)","v":57.157239974468837},{"$f":"Temperaturen!$B$2+Temperaturen!$B$6-(P88/2)","v":57.719926871557739},null,{"$f":"Temperaturen!$B$2+Temperaturen!$B$6-(R88/2)","v":58.891356463018177},{"$f":"Temperaturen!$B$2+Temperaturen!$B$6-(S88/2)","v":59.052039261837834},{"$f":"Temperaturen!$B$2+Temperaturen!$B$6-(T88/2)","v":58.940790060828611},{"$f":"Temperaturen!$B$2+Temperaturen!$B$6-(U88/2)","v":59.084720138795902},{"$f":"Temperaturen!$B$2+Temperaturen!$B$6-(V88/2)","v":58.713547557190289},{"$f":"Temperaturen!$B$2+Temperaturen!$B$6-(W88/2)","v":59.065827383226626}]
["leicht wolkig Azimut > ",40,"Diff. Solarkreis (K) > ",{"$f":"Sommer!D68/(3.7*($B$9/3600))","v":6.5594899731891898},{"$f":"Sommer!E68/(3.7*($B$9/3600))","v":6.0537451333490013},{"$f":"Sommer!F68/(3.7*($B$9/3600))","v":6.4667090909595997},{"$f":"Sommer!G68/(3.7*($B$9/3600))","v":5.9877034046065774},{"$f":"Sommer!H68/(3.7*($B$9/3600))","v":6.2679293167015997},{"$f":"Sommer!I68/(3.7*($B$9/3600))","v":5.6852529349540939},null,{"$f":"Herbstfrühjahr!D68/(3.7*(Temperaturen!$B$9/3600))","v":5.1052664653491915},{"$f":"Herbstfrühjahr!E68/(3.7*(Temperaturen!$B$9/3600))","v":4.6796115261668643},{"$f":"Herbstfrühjahr!F68/(3.7*(Temperaturen!$B$9/3600))","v":5.0317494432876915},{"$f":"Herbstfrühjahr!G68/(3.7*(Temperaturen!$B$9/3600))","v":4.6109641082188801},{"$f":"Herbstfrühjahr!H68/(3.7*(Temperaturen!$B$9/3600))","v":5.0239001847633773},{"$f":"Herbstfrühjahr!I68/(3.7*(Temperaturen!$B$9/3600))","v":4.4935723820840554},null,{"$f":"Winter!D68/(3.7*(Temperaturen!$B$9/3600))","v":0.64129320070054097},{"$f":"Winter!E68/(3.7*(Temperaturen!$B$9/3600))","v":0.43404465940305553},{"$f":"Winter!F68/(3.7*(Temperaturen!$B$9/3600))","v":0.5854440048676901},{"$f":"Winter!G68/(3.7*(Temperaturen!$B$9/3600))","v":0.37527912446704864},{"$f":"Winter!H68/(3.7*(Temperaturen!$B$9/3600))","v":1.3926485574605627},{"$f":"Winter!I68/(3.7*(Temperaturen!$B$9/3600))","v":0.93222192419759498}]
[null,null,"Solar VL Temperatur (°C) > ",{"$f":"$B$2+$B$6+(D91/2)","v":63.279744986594594},63.026872566674498,63.233354545479799,62.993851702303289,63.133964658350799,62.842626467477047,null,{"$f":"Temperaturen!$B$2+Temperaturen!$B$6+(K91/2)","v":62.552633232674594},{"$f":"Temperaturen!$B$2+Temperaturen!$B$6+(L91/2)","v":62.339805763083433},{"$f":"Temperaturen!$B$2+Temperaturen!$B$6+(M91/2)","v":62.515874721643847},{"$f":"Temperaturen!$B$2+Temperaturen!$B$6+(N91/2)","v":62.30548205410944},{"$f":"Temperaturen!$B$2+Temperaturen!$B$6+(O91/2)","v":62.511950092381689},{"$f":"Temperaturen!$B$2+Temperaturen!$B$6+(P91/2)","v":62.246786191042027},null,{"$f":"Temperaturen!$B$2+Temperaturen!$B$6+(R91/2)","v":60.320646600350273},{"$f":"Temperaturen!$B$2+Temperaturen!$B$6+(S91/2)","v":60.217022329701528},{"$f":"Temperaturen!$B$2+Temperaturen!$B$6+(T91/2)","v":60.292722002433848},{"$f":"Temperaturen!$B$2+Temperaturen!$B$6+(U91/2)","v":60.187639562233521},{"$f":"Temperaturen!$B$2+Temperaturen!$B$6+(V91/2)","v":60.69632427873028},{"$f":"Temperaturen!$B$2+Temperaturen!$B$6+(W91/2)","v":60.466110962098796}]
[null,null,"Solar RL Temperatur (°C) > ",{"$f":"$B$2+$B$6-(D91/2)","v":56.720255013405406},56.973127433325502,56.766645454520201,57.006148297696711,56.866035341649201,57.157373532522953,null,{"$f":"Temperaturen!$B$2+Temperaturen!$B$6-(K91/2)","v":57.447366767325406},{"$f":"Temperaturen!$B$2+Temperaturen!$B$6-(L91/2)","v":57.660194236916567},{"$f":"Temperaturen!$B$2+Temperaturen!$B$6-(M91/2)","v":57.484125278356153},{"$f":"Temperaturen!$B$2+Temperaturen!$B$6-(N91/2)","v":57.69451794589056},{"$f":"Temperaturen!$B$2+Temperaturen!$B$6-(O91/2)","v":57.488049907618311},{"$f":"Temperaturen!$B$2+Temperaturen!$B$6-(P91/2)","v":57.753213808957973},null,{"$f":"Temperaturen!$B$2+Temperaturen!$B$6-(R91/2)","v":59.679353399649727},{"$f":"Temperaturen!$B$2+Temperaturen!$B$6-(S91/2)","v":59.782977670298472},{"$f":"Temperaturen!$B$2+Temperaturen!$B$6-(T91/2)","v":59.707277997566152},{"$f":"Temperaturen!$B$2+Temperaturen!$B$6-(U91/2)","v":59.812360437766479},{"$f":"Temperaturen!$B$2+Temperaturen!$B$6-(V91/2)","v":59.30367572126972},{"$f":"Temperaturen!$B$2+Temperaturen!$B$6-(W91/2)","v":59.533889037901204}]
["leicht wolkig Azimut > ",50,"Diff. Solarkreis (K) > ",{"$f":"Sommer!D69/(3.7*($B$9/3600))","v":5.9167277508648644},{"$f":"Sommer!E69/(3.7*($B$9/3600))","v":5.3876283404935377},{"$f":"Sommer!F69/(3.7*($B$9/3600))","v":5.7649706568603447},{"$f":"Sommer!G69/(3.7*($B$9/3600))","v":5.3822528132072964},{"$f":"Sommer!H69/(3.7*($B$9/3600))","v":5.6336607291891898},{"$f":"Sommer!I69/(3.7*($B$9/3600))","v":5.5248210881572488},null,{"$f":"Herbstfrühjahr!D69/(3.7*(Temperaturen!$B$9/3600))","v":4.1983387879427028},{"$f":"Herbstfrühjahr!E69/(3.7*(Temperaturen!$B$9/3600))","v":3.7773682202773204},{"$f":"Herbstfrühjahr!F69/(3.7*(Temperaturen!$B$9/3600))","v":4.0824714244000377},{"$f":"Herbstfrühjahr!G69/(3.7*(Temperaturen!$B$9/3600))","v":3.7534677257781932},{"$f":"Herbstfrühjahr!H69/(3.7*(Temperaturen!$B$9/3600))","v":4.212399635027027},{"$f":"Herbstfrühjahr!I69/(3.7*(Temperaturen!$B$9/3600))","v":4.0321307970168387},null,{"$f":"Winter!D69/(3.7*(Temperaturen!$B$9/3600))","v":0},{"$f":"Winter!E69/(3.7*(Temperaturen!$B$9/3600))","v":0},{"$f":"Winter!F69/(3.7*(Temperaturen!$B$9/3600))","v":0},{"$f":"Winter!G69/(3.7*(Temperaturen!$B$9/3600))","v":0},{"$f":"Winter!H69/(3.7*(Temperaturen!$B$9/3600))","v":0.2778719354594596},{"$f":"Winter!I69/(3.7*(Temperaturen!$B$9/3600))","v":0}]
[null,null,"Solar VL Temperatur (°C) > ",{"$f":"$B$2+$B$6+(D94/2)","v":62.958363875432433},62.693814170246768,62.882485328430171,62.691126406603651,62.816830364594594,62.762410544078627,null,{"$f":"Temperaturen!$B$2+Temperaturen!$B$6+(K94/2)","v":62.099169393971351},{"$f":"Temperaturen!$B$2+Temperaturen!$B$6+(L94/2)","v":61.888684110138662},{"$f":"Temperaturen!$B$2+Temperaturen!$B$6+(M94/2)","v":62.04123571220002},{"$f":"Temperaturen!$B$2+Temperaturen!$B$6+(N94/2)","v":61.876733862889097},{"$f":"Temperaturen!$B$2+Temperaturen!$B$6+(O94/2)","v":62.106199817513513},{"$f":"Temperaturen!$B$2+Temperaturen!$B$6+(P94/2)","v":62.016065398508417},null,{"$f":"Temperaturen!$B$2+Temperaturen!$B$6+(R94/2)","v":60},{"$f":"Temperaturen!$B$2+Temperaturen!$B$6+(S94/2)","v":60},{"$f":"Temperaturen!$B$2+Temperaturen!$B$6+(T94/2)","v":60},{"$f":"Temperaturen!$B$2+Temperaturen!$B$6+(U94/2)","v":60},{"$f":"Temperaturen!$B$2+Temperaturen!$B$6+(V94/2)","v":60.138935967729729},{"$f":"Temperaturen!$B$2+Temperaturen!$B$6+(W94/2)","v":60}]
[null,null,"Solar RL Temperatur (°C) > ",{"$f":"$B$2+$B$6-(D94/2)","v":57.041636124567567},57.306185829753232,57.117514671569829,57.308873593396349,57.183169635405406,57.237589455921373,null,{"$f":"Temperaturen!$B$2+Temperaturen!$B$6-(K94/2)","v":57.900830606028649},{"$f":"Temperaturen!$B$2+Temperaturen!$B$6-(L94/2)","v":58.111315889861338},{"$f":"Temperaturen!$B$2+Temperaturen!$B$6-(M94/2)","v":57.95876428779998},{"$f":"Temperaturen!$B$2+Temperaturen!$B$6-(N94/2)","v":58.123266137110903},{"$f":"Temperaturen!$B$2+Temperaturen!$B$6-(O94/2)","v":57.893800182486487},{"$f":"Temperaturen!$B$2+Temperaturen!$B$6-(P94/2)","v":57.983934601491583},null,{"$f":"Temperaturen!$B$2+Temperaturen!$B$6-(R94/2)","v":60},{"$f":"Temperaturen!$B$2+Temperaturen!$B$6-(S94/2)","v":60},{"$f":"Temperaturen!$B$2+Temperaturen!$B$6-(T94/2)","v":60},{"$f":"Temperaturen!$B$2+Temperaturen!$B$6-(U94/2)","v":60},{"$f":"Temperaturen!$B$2+Temperaturen!$B$6-(V94/2)","v":59.861064032270271},{"$f":"Temperaturen!$B$2+Temperaturen!$B$6-(W94/2)","v":60}]
["leicht wolkig Azimut > ",60,"Diff. Solarkreis (K) > ",{"$f":"Sommer!D70/(3.7*($B$9/3600))","v":4.7480922372162171},{"$f":"Sommer!E70/(3.7*($B$9/3600))","v":4.4997813772032922},{"$f":"Sommer!F70/(3.7*($B$9/3600))","v":4.8296429040587618},{"$f":"Sommer!G70/(3.7*($B$9/3600))","v":4.4430971662894425},{"$f":"Sommer!H70/(3.7*($B$9/3600))","v":5.438228815250965},{"$f":"Sommer!I70/(3.7*($B$9/3600))","v":4.8451701565426104},null,{"$f":"Herbstfrühjahr!D70/(3.7*(Temperaturen!$B$9/3600))","v":2.7213346162897305},{"$f":"Herbstfrühjahr!E70/(3.7*(Temperaturen!$B$9/3600))","v":2.5078701303877797},{"$f":"Herbstfrühjahr!F70/(3.7*(Temperaturen!$B$9/3600))","v":2.7470870793709383},{"$f":"Herbstfrühjahr!G70/(3.7*(Temperaturen!$B$9/3600))","v":2.4517151302143523},{"$f":"Herbstfrühjahr!H70/(3.7*(Temperaturen!$B$9/3600))","v":3.5068015070270273},{"$f":"Herbstfrühjahr!I70/(3.7*(Temperaturen!$B$9/3600))","v":2.9653958465771115},null,{"$f":"Winter!D70/(3.7*(Temperaturen!$B$9/3600))","v":0},{"$f":"Winter!E70/(3.7*(Temperaturen!$B$9/3600))","v":0},{"$f":"Winter!F70/(3.7*(Temperaturen!$B$9/3600))","v":0},{"$f":"Winter!G70/(3.7*(Temperaturen!$B$9/3600))","v":0},{"$f":"Winter!H70/(3.7*(Temperaturen!$B$9/3600))","v":0},{"$f":"Winter!I70/(3.7*(Temperaturen!$B$9/3600))","v":0}]
[null,null,"Solar VL Temperatur (°C) > ",{"$f":"$B$2+$B$6+(D97/2)","v":62.374046118608106},62.249890688601646,62.414821452029379,62.221548583144724,62.719114407625483,62.422585078271304,null,{"$f":"Temperaturen!$B$2+Temperaturen!$B$6+(K97/2)","v":61.360667308144862},{"$f":"Temperaturen!$B$2+Temperaturen!$B$6+(L97/2)","v":61.253935065193893},{"$f":"Temperaturen!$B$2+Temperaturen!$B$6+(M97/2)","v":61.373543539685471},{"$f":"Temperaturen!$B$2+Temperaturen!$B$6+(N97/2)","v":61.225857565107177},{"$f":"Temperaturen!$B$2+Temperaturen!$B$6+(O97/2)","v":61.75340075351351},{"$f":"Temperaturen!$B$2+Temperaturen!$B$6+(P97/2)","v":61.482697923288555},null,{"$f":"Temperaturen!$B$2+Temperaturen!$B$6+(R97/2)","v":60},{"$f":"Temperaturen!$B$2+Temperaturen!$B$6+(S97/2)","v":60},{"$f":"Temperaturen!$B$2+Temperaturen!$B$6+(T97/2)","v":60},{"$f":"Temperaturen!$B$2+Temperaturen!$B$6+(U97/2)","v":60},{"$f":"Temperaturen!$B$2+Temperaturen!$B$6+(V97/2)","v":60},{"$f":"Temperaturen!$B$2+Temperaturen!$B$6+(W97/2)","v":60}]
[null,null,"Solar RL Temperatur (°C) > ",{"$f":"$B$2+$B$6-(D97/2)","v":57.625953881391894},57.750109311398354,57.585178547970621,57.778451416855276,57.280885592374517,57.577414921728696,null,{"$f":"Temperaturen!$B$2+Temperaturen!$B$6-(K97/2)","v":58.639332691855138},{"$f":"Temperaturen!$B$2+Temperaturen!$B$6-(L97/2)","v":58.746064934806107},{"$f":"Temperaturen!$B$2+Temperaturen!$B$6-(M97/2)","v":58.626456460314529},{"$f":"Temperaturen!$B$2+Temperaturen!$B$6-(N97/2)","v":58.774142434892823},{"$f":"Temperaturen!$B$2+Temperaturen!$B$6-(O97/2)","v":58.24659924648649},{"$f":"Temperaturen!$B$2+Temperaturen!$B$6-(P97/2)","v":58.517302076711445},null,{"$f":"Temperaturen!$B$2+Temperaturen!$B$6-(R97/2)","v":60},{"$f":"Temperaturen!$B$2+Temperaturen!$B$6-(S97/2)","v":60},{"$f":"Temperaturen!$B$2+Temperaturen!$B$6-(T97/2)","v":60},{"$f":"Temperaturen!$B$2+Temperaturen!$B$6-(U97/2)","v":60},{"$f":"Temperaturen!$B$2+Temperaturen!$B$6-(V97/2)","v":60},{"$f":"Temperaturen!$B$2+Temperaturen!$B$6-(W97/2)","v":60}]
["leicht wolkig Azimut > ",70,"Diff. Solarkreis (K) > ",{"$f":"Sommer!D71/(3.7*($B$9/3600))","v":3.2228390104054059},{"$f":"Sommer!E71/(3.7*($B$9/3600))","v":3.1624471464159822},{"$f":"Sommer!F71/(3.7*($B$9/3600))","v":3.4584001073208404},{"$f":"Sommer!G71/(3.7*($B$9/3600))","v":3.1544467798162721},{"$f":"Sommer!H71/(3.7*($B$9/3600))","v":4.9759327444567027},{"$f":"Sommer!I71/(3.7*($B$9/3600))","v":3.3045079554258385},null,{"$f":"Herbstfrühjahr!D71/(3.7*(Temperaturen!$B$9/3600))","v":0.90931877743135137},{"$f":"Herbstfrühjahr!E71/(3.7*(Temperaturen!$B$9/3600))","v":0.77680842152761453},{"$f":"Herbstfrühjahr!F71/(3.7*(Temperaturen!$B$9/3600))","v":0.93164751089330389},{"$f":"Herbstfrühjahr!G71/(3.7*(Temperaturen!$B$9/3600))","v":0.74202351728611338},{"$f":"Herbstfrühjahr!H71/(3.7*(Temperaturen!$B$9/3600))","v":2.1970103873976825},{"$f":"Herbstfrühjahr!I71/(3.7*(Temperaturen!$B$9/3600))","v":1.2265906167732057},null,{"$f":"Winter!D71/(3.7*(Temperaturen!$B$9/3600))","v":0},{"$f":"Winter!E71/(3.7*(Temperaturen!$B$9/3600))","v":0},{"$f":"Winter!F71/(3.7*(Temperaturen!$B$9/3600))","v":0},{"$f":"Winter!G71/(3.7*(Temperaturen!$B$9/3600))","v":0},{"$f":"Winter!H71/(3.7*(Temperaturen!$B$9/3600))","v":0},{"$f":"Winter!I71/(3.7*(Temperaturen!$B$9/3600))","v":0}]
[null,null,"Solar VL Temperatur (°C) > ",{"$f":"$B$2+$B$6+(D100/2)","v":61.611419505202704},61.581223573207993,61.729200053660421,61.577223389908134,62.48796637222835,61.652253977712917,null,{"$f":"Temperaturen!$B$2+Temperaturen!$B$6+(K100/2)","v":60.454659388715676},{"$f":"Temperaturen!$B$2+Temperaturen!$B$6+(L100/2)","v":60.388404210763809},{"$f":"Temperaturen!$B$2+Temperaturen!$B$6+(M100/2)","v":60.46582375544665},{"$f":"Temperaturen!$B$2+Temperaturen!$B$6+(N100/2)","v":60.371011758643057},{"$f":"Temperaturen!$B$2+Temperaturen!$B$6+(O100/2)","v":61.098505193698841},{"$f":"Temperaturen!$B$2+Temperaturen!$B$6+(P100/2)","v":60.613295308386604},null,{"$f":"Temperaturen!$B$2+Temperaturen!$B$6+(R100/2)","v":60},{"$f":"Temperaturen!$B$2+Temperaturen!$B$6+(S100/2)","v":60},{"$f":"Temperaturen!$B$2+Temperaturen!$B$6+(T100/2)","v":60},{"$f":"Temperaturen!$B$2+Temperaturen!$B$6+(U100/2)","v":60},{"$f":"Temperaturen!$B$2+Temperaturen!$B$6+(V100/2)","v":60},{"$f":"Temperaturen!$B$2+Temperaturen!$B$6+(W100/2)","v":60}]
[null,null,"Solar RL Temperatur (°C) > ",{"$f":"$B$2+$B$6-(D100/2)","v":58.388580494797296},58.418776426792007,58.270799946339579,58.422776610091866,57.51203362777165,58.347746022287083,null,{"$f":"Temperaturen!$B$2+Temperaturen!$B$6-(K100/2)","v":59.545340611284324},{"$f":"Temperaturen!$B$2+Temperaturen!$B$6-(L100/2)","v":59.611595789236191},{"$f":"Temperaturen!$B$2+Temperaturen!$B$6-(M100/2)","v":59.53417624455335},{"$f":"Temperaturen!$B$2+Temperaturen!$B$6-(N100/2)","v":59.628988241356943},{"$f":"Temperaturen!$B$2+Temperaturen!$B$6-(O100/2)","v":58.901494806301159},{"$f":"Temperaturen!$B$2+Temperaturen!$B$6-(P100/2)","v":59.386704691613396},null,{"$f":"Temperaturen!$B$2+Temperaturen!$B$6-(R100/2)","v":60},{"$f":"Temperaturen!$B$2+Temperaturen!$B$6-(S100/2)","v":60},{"$f":"Temperaturen!$B$2+Temperaturen!$B$6-(T100/2)","v":60},{"$f":"Temperaturen!$B$2+Temperaturen!$B$6-(U100/2)","v":60},{"$f":"Temperaturen!$B$2+Temperaturen!$B$6-(V100/2)","v":60},{"$f":"Temperaturen!$B$2+Temperaturen!$B$6-(W100/2)","v":60}]
["Detailtemperaturen bei allen Winkelfaktoren",null,null,"Detailtemperaturen Sommer bei mittel bewölkt",null,null,null,null,null,null,"Detailtemperaturen Sommer bei mittel bewölkt",null,null,null,null,null,null,"Detailtemperaturen Sommer bei mittel bewölkt"]
["mittel wolkig Azimut > ",-70,"Diff. Solarkreis (K) > ",{"$f":"Sommer!D86/(3.7*($B$9/3600))","v":1.619712603121622},{"$f":"Sommer!E86/(3.7*($B$9/3600))","v":1.5000805226792011},{"$f":"Sommer!F86/(3.7*($B$9/3600))","v":1.6949445475524998},{"$f":"Sommer!G86/(3.7*($B$9/3600))","v":1.478218842337905},{"$f":"Sommer!H86/(3.7*($B$9/3600))","v":3.1327664633314947},{"$f":"Sommer!I86/(3.7*($B$9/3600))","v":1.8969085681148332},null,{"$f":"Herbstfrühjahr!D86/(3.7*(Temperaturen!$B$9/3600))","v":0.12800308413405409},{"$f":"Herbstfrühjahr!E86/(3.7*(Temperaturen!$B$9/3600))","v":0},{"$f":"Herbstfrühjahr!F86/(3.7*(Temperaturen!$B$9/3600))","v":7.2192200931914391E-2},{"$f":"Herbstfrühjahr!G86/(3.7*(Temperaturen!$B$9/3600))","v":0},{"$f":"Herbstfrühjahr!H86/(3.7*(Temperaturen!$B$9/3600))","v":1.298706464353006},{"$f":"Herbstfrühjahr!I86/(3.7*(Temperaturen!$B$9/3600))","v":0.5405689242947368},null,{"$f":"Winter!D86/(3.7*(Temperaturen!$B$9/3600))","v":0},{"$f":"Winter!E86/(3.7*(Temperaturen!$B$9/3600))","v":0},{"$f":"Winter!F86/(3.7*(Temperaturen!$B$9/3600))","v":0},{"$f":"Winter!G86/(3.7*(Temperaturen!$B$9/3600))","v":0},{"$f":"Winter!H86/(3.7*(Temperaturen!$B$9/3600))","v":0},{"$f":"Winter!I86/(3.7*(Temperaturen!$B$9/3600))","v":0}]
[null,null,"Solar VL Temperatur (°C) > ",{"$f":"$B$2+$B$6+(D104/2)","v":60.809856301560814},60.750040261339599,60.847472273776248,60.739109421168955,61.566383231665746,60.948454284057419,null,{"$f":"Temperaturen!$B$2+Temperaturen!$B$6+(K104/2)","v":60.064001542067025},{"$f":"Temperaturen!$B$2+Temperaturen!$B$6+(L104/2)","v":60},{"$f":"Temperaturen!$B$2+Temperaturen!$B$6+(M104/2)","v":60.036096100465954},{"$f":"Temperaturen!$B$2+Temperaturen!$B$6+(N104/2)","v":60},{"$f":"Temperaturen!$B$2+Temperaturen!$B$6+(O104/2)","v":60.649353232176502},{"$f":"Temperaturen!$B$2+Temperaturen!$B$6+(P104/2)","v":60.270284462147366},null,{"$f":"Temperaturen!$B$2+Temperaturen!$B$6+(R104/2)","v":60},{"$f":"Temperaturen!$B$2+Temperaturen!$B$6+(S104/2)","v":60},{"$f":"Temperaturen!$B$2+Temperaturen!$B$6+(T104/2)","v":60},{"$f":"Temperaturen!$B$2+Temperaturen!$B$6+(U104/2)","v":60},{"$f":"Temperaturen!$B$2+Temperaturen!$B$6+(V104/2)","v":60},{"$f":"Temperaturen!$B$2+Temperaturen!$B$6+(W104/2)","v":60}]
[null,null,"Solar RL Temperatur (°C) > ",{"$f":"$B$2+$B$6-(D104/2)","v":59.190143698439186},59.249959738660401,59.152527726223752,59.260890578831045,58.433616768334254,59.051545715942581,null,{"$f":"Temperaturen!$B$2+Temperaturen!$B$6-(K104/2)","v":59.935998457932975},{"$f":"Temperaturen!$B$2+Temperaturen!$B$6-(L104/2)","v":60},{"$f":"Temperaturen!$B$2+Temperaturen!$B$6-(M104/2)","v":59.963903899534046},{"$f":"Temperaturen!$B$2+Temperaturen!$B$6-(N104/2)","v":60},{"$f":"Temperaturen!$B$2+Temperaturen!$B$6-(O104/2)","v":59.350646767823498},{"$f":"Temperaturen!$B$2+Temperaturen!$B$6-(P104/2)","v":59.729715537852634},null,{"$f":"Temperaturen!$B$2+Temperaturen!$B$6-(R104/2)","v":60},{"$f":"Temperaturen!$B$2+Temperaturen!$B$6-(S104/2)","v":60},{"$f":"Temperaturen!$B$2+Temperaturen!$B$6-(T104/2)","v":60},{"$f":"Temperaturen!$B$2+Temperaturen!$B$6-(U104/2)","v":60},{"$f":"Temperaturen!$B$2+Temperaturen!$B$6-(V104/2)","v":60},{"$f":"Temperaturen!$B$2+Temperaturen!$B$6-(W104/2)","v":60}]
["mittel wolkig Azimut > ",-60,"Diff. Solarkreis (K) > ",{"$f":"Sommer!D87/(3.7*($B$9/3600))","v":2.5423699015945953},{"$f":"Sommer!E87/(3.7*($B$9/3600))","v":2.3156094796709756},{"$f":"Sommer!F87/(3.7*($B$9/3600))","v":2.5412557982672563},{"$f":"Sommer!G87/(3.7*($B$9/3600))","v":2.2679029135933972},{"$f":"Sommer!H87/(3.7*($B$9/3600))","v":3.4555313727799235},{"$f":"Sommer!I87/(3.7*($B$9/3600))","v":2.8605912524939874},null,{"$f":"Herbstfrühjahr!D87/(3.7*(Temperaturen!$B$9/3600))","v":1.2508530592086489},{"$f":"Herbstfrühjahr!E87/(3.7*(Temperaturen!$B$9/3600))","v":1.0517555320329028},{"$f":"Herbstfrühjahr!F87/(3.7*(Temperaturen!$B$9/3600))","v":1.2214956755099349},{"$f":"Herbstfrühjahr!G87/(3.7*(Temperaturen!$B$9/3600))","v":1.0015856284169884},{"$f":"Herbstfrühjahr!H87/(3.7*(Temperaturen!$B$9/3600))","v":2.185003212046333},{"$f":"Herbstfrühjahr!I87/(3.7*(Temperaturen!$B$9/3600))","v":1.6423432438780294},null,{"$f":"Winter!D87/(3.7*(Temperaturen!$B$9/3600))","v":0},{"$f":"Winter!E87/(3.7*(Temperaturen!$B$9/3600))","v":0},{"$f":"Winter!F87/(3.7*(Temperaturen!$B$9/3600))","v":0},{"$f":"Winter!G87/(3.7*(Temperaturen!$B$9/3600))","v":0},{"$f":"Winter!H87/(3.7*(Temperaturen!$B$9/3600))","v":0},{"$f":"Winter!I87/(3.7*(Temperaturen!$B$9/3600))","v":0}]
[null,null,"Solar VL Temperatur (°C) > ",{"$f":"$B$2+$B$6+(D107/2)","v":61.271184950797299},61.157804739835491,61.270627899133629,61.133951456796702,61.727765686389965,61.430295626246995,null,{"$f":"Temperaturen!$B$2+Temperaturen!$B$6+(K107/2)","v":60.625426529604326},{"$f":"Temperaturen!$B$2+Temperaturen!$B$6+(L107/2)","v":60.52587776601645},{"$f":"Temperaturen!$B$2+Temperaturen!$B$6+(M107/2)","v":60.610747837754964},{"$f":"Temperaturen!$B$2+Temperaturen!$B$6+(N107/2)","v":60.500792814208495},{"$f":"Temperaturen!$B$2+Temperaturen!$B$6+(O107/2)","v":61.09250160602317},{"$f":"Temperaturen!$B$2+Temperaturen!$B$6+(P107/2)","v":60.821171621939015},null,{"$f":"Temperaturen!$B$2+Temperaturen!$B$6+(R107/2)","v":60},{"$f":"Temperaturen!$B$2+Temperaturen!$B$6+(S107/2)","v":60},{"$f":"Temperaturen!$B$2+Temperaturen!$B$6+(T107/2)","v":60},{"$f":"Temperaturen!$B$2+Temperaturen!$B$6+(U107/2)","v":60},{"$f":"Temperaturen!$B$2+Temperaturen!$B$6+(V107/2)","v":60},{"$f":"Temperaturen!$B$2+Temperaturen!$B$6+(W107/2)","v":60}]
[null,null,"Solar RL Temperatur (°C) > ",{"$f":"$B$2+$B$6-(D107/2)","v":58.728815049202701},58.842195260164509,58.729372100866371,58.866048543203298,58.272234313610035,58.569704373753005,null,{"$f":"Temperaturen!$B$2+Temperaturen!$B$6-(K107/2)","v":59.374573470395674},{"$f":"Temperaturen!$B$2+Temperaturen!$B$6-(L107/2)","v":59.47412223398355},{"$f":"Temperaturen!$B$2+Temperaturen!$B$6-(M107/2)","v":59.389252162245036},{"$f":"Temperaturen!$B$2+Temperaturen!$B$6-(N107/2)","v":59.499207185791505},{"$f":"Temperaturen!$B$2+Temperaturen!$B$6-(O107/2)","v":58.90749839397683},{"$f":"Temperaturen!$B$2+Temperaturen!$B$6-(P107/2)","v":59.178828378060985},null,{"$f":"Temperaturen!$B$2+Temperaturen!$B$6-(R107/2)","v":60},{"$f":"Temperaturen!$B$2+Temperaturen!$B$6-(S107/2)","v":60},{"$f":"Temperaturen!$B$2+Temperaturen!$B$6-(T107/2)","v":60},{"$f":"Temperaturen!$B$2+Temperaturen!$B$6-(U107/2)","v":60},{"$f":"Temperaturen!$B$2+Temperaturen!$B$6-(V107/2)","v":60},{"$f":"Temperaturen!$B$2+Temperaturen!$B$6-(W107/2)","v":60}]
["mittel wolkig Azimut > ",-50,"Diff. Solarkreis (K) > ",{"$f":"Sommer!D88/(3.7*($B$9/3600))","v":3.2635044372162163},{"$f":"Sommer!E88/(3.7*($B$9/3600))","v":2.8770965764512346},{"$f":"Sommer!F88/(3.7*($B$9/3600))","v":3.1346518051228918},{"$f":"Sommer!G88/(3.7*($B$9/3600))","v":2.8554421302090272},{"$f":"Sommer!H88/(3.7*($B$9/3600))","v":3.5971496156756757},{"$f":"Sommer!I88/(3.7*($B$9/3600))","v":3.3081766170748748},null,{"$f":"Herbstfrühjahr!D88/(3.7*(Temperaturen!$B$9/3600))","v":2.1831159936454054},{"$f":"Herbstfrühjahr!E88/(3.7*(Temperaturen!$B$9/3600))","v":1.8705250191492366},{"$f":"Herbstfrühjahr!F88/(3.7*(Temperaturen!$B$9/3600))","v":2.0846454294965624},{"$f":"Herbstfrühjahr!G88/(3.7*(Temperaturen!$B$9/3600))","v":1.8342600740673685},{"$f":"Herbstfrühjahr!H88/(3.7*(Temperaturen!$B$9/3600))","v":2.6655929280000006},{"$f":"Herbstfrühjahr!I88/(3.7*(Temperaturen!$B$9/3600))","v":2.3485060368999355},null,{"$f":"Winter!D88/(3.7*(Temperaturen!$B$9/3600))","v":0},{"$f":"Winter!E88/(3.7*(Temperaturen!$B$9/3600))","v":0},{"$f":"Winter!F88/(3.7*(Temperaturen!$B$9/3600))","v":0},{"$f":"Winter!G88/(3.7*(Temperaturen!$B$9/3600))","v":0},{"$f":"Winter!H88/(3.7*(Temperaturen!$B$9/3600))","v":6.3155388000000007E-2},{"$f":"Winter!I88/(3.7*(Temperaturen!$B$9/3600))","v":0}]
[null,null,"Solar VL Temperatur (°C) > ",{"$f":"$B$2+$B$6+(D110/2)","v":61.631752218608106},61.438548288225618,61.567325902561443,61.427721065104514,61.798574807837838,61.654088308537439,null,{"$f":"Temperaturen!$B$2+Temperaturen!$B$6+(K110/2)","v":61.091557996822701},{"$f":"Temperaturen!$B$2+Temperaturen!$B$6+(L110/2)","v":60.935262509574621},{"$f":"Temperaturen!$B$2+Temperaturen!$B$6+(M110/2)","v":61.042322714748281},{"$f":"Temperaturen!$B$2+Temperaturen!$B$6+(N110/2)","v":60.917130037033687},{"$f":"Temperaturen!$B$2+Temperaturen!$B$6+(O110/2)","v":61.332796463999998},{"$f":"Temperaturen!$B$2+Temperaturen!$B$6+(P110/2)","v":61.174253018449967},null,{"$f":"Temperaturen!$B$2+Temperaturen!$B$6+(R110/2)","v":60},{"$f":"Temperaturen!$B$2+Temperaturen!$B$6+(S110/2)","v":60},{"$f":"Temperaturen!$B$2+Temperaturen!$B$6+(T110/2)","v":60},{"$f":"Temperaturen!$B$2+Temperaturen!$B$6+(U110/2)","v":60},{"$f":"Temperaturen!$B$2+Temperaturen!$B$6+(V110/2)","v":60.031577693999999},{"$f":"Temperaturen!$B$2+Temperaturen!$B$6+(W110/2)","v":60}]
[null,null,"Solar RL Temperatur (°C) > ",{"$f":"$B$2+$B$6-(D110/2)","v":58.368247781391894},58.561451711774382,58.432674097438557,58.572278934895486,58.201425192162162,58.345911691462561,null,{"$f":"Temperaturen!$B$2+Temperaturen!$B$6-(K110/2)","v":58.908442003177299},{"$f":"Temperaturen!$B$2+Temperaturen!$B$6-(L110/2)","v":59.064737490425379},{"$f":"Temperaturen!$B$2+Temperaturen!$B$6-(M110/2)","v":58.957677285251719},{"$f":"Temperaturen!$B$2+Temperaturen!$B$6-(N110/2)","v":59.082869962966313},{"$f":"Temperaturen!$B$2+Temperaturen!$B$6-(O110/2)","v":58.667203536000002},{"$f":"Temperaturen!$B$2+Temperaturen!$B$6-(P110/2)","v":58.825746981550033},null,{"$f":"Temperaturen!$B$2+Temperaturen!$B$6-(R110/2)","v":60},{"$f":"Temperaturen!$B$2+Temperaturen!$B$6-(S110/2)","v":60},{"$f":"Temperaturen!$B$2+Temperaturen!$B$6-(T110/2)","v":60},{"$f":"Temperaturen!$B$2+Temperaturen!$B$6-(U110/2)","v":60},{"$f":"Temperaturen!$B$2+Temperaturen!$B$6-(V110/2)","v":59.968422306000001},{"$f":"Temperaturen!$B$2+Temperaturen!$B$6-(W110/2)","v":60}]
["mittel wolkig Azimut > ",-40,"Diff. Solarkreis (K) > ",{"$f":"Sommer!D89/(3.7*($B$9/3600))","v":3.677523633729729},{"$f":"Sommer!E89/(3.7*($B$9/3600))","v":3.2983662792949464},{"$f":"Sommer!F89/(3.7*($B$9/3600))","v":3.5798605565966657},{"$f":"Sommer!G89/(3.7*($B$9/3600))","v":3.2436500386100398},{"$f":"Sommer!H89/(3.7*($B$9/3600))","v":4.0135208833866516},{"$f":"Sommer!I89/(3.7*($B$9/3600))","v":3.4316769510927196},null,{"$f":"Herbstfrühjahr!D89/(3.7*(Temperaturen!$B$9/3600))","v":2.7746328169167569},{"$f":"Herbstfrühjahr!E89/(3.7*(Temperaturen!$B$9/3600))","v":2.4513486268014106},{"$f":"Herbstfrühjahr!F89/(3.7*(Temperaturen!$B$9/3600))","v":2.6971675850637529},{"$f":"Herbstfrühjahr!G89/(3.7*(Temperaturen!$B$9/3600))","v":2.3918600818042881},{"$f":"Herbstfrühjahr!H89/(3.7*(Temperaturen!$B$9/3600))","v":3.2007698865173753},{"$f":"Herbstfrühjahr!I89/(3.7*(Temperaturen!$B$9/3600))","v":2.6711152820918143},null,{"$f":"Winter!D89/(3.7*(Temperaturen!$B$9/3600))","v":0},{"$f":"Winter!E89/(3.7*(Temperaturen!$B$9/3600))","v":0},{"$f":"Winter!F89/(3.7*(Temperaturen!$B$9/3600))","v":0},{"$f":"Winter!G89/(3.7*(Temperaturen!$B$9/3600))","v":0},{"$f":"Winter!H89/(3.7*(Temperaturen!$B$9/3600))","v":0.80135643250524013},{"$f":"Winter!I89/(3.7*(Temperaturen!$B$9/3600))","v":0.34114813625656282}]
[null,null,"Solar VL Temperatur (°C) > ",{"$f":"$B$2+$B$6+(D113/2)","v":61.838761816864867},61.649183139647477,61.789930278298336,61.621825019305021,62.006760441693324,61.715838475546363,null,{"$f":"Temperaturen!$B$2+Temperaturen!$B$6+(K113/2)","v":61.387316408458375},{"$f":"Temperaturen!$B$2+Temperaturen!$B$6+(L113/2)","v":61.225674313400702},{"$f":"Temperaturen!$B$2+Temperaturen!$B$6+(M113/2)","v":61.348583792531876},{"$f":"Temperaturen!$B$2+Temperaturen!$B$6+(N113/2)","v":61.195930040902141},{"$f":"Temperaturen!$B$2+Temperaturen!$B$6+(O113/2)","v":61.600384943258689},{"$f":"Temperaturen!$B$2+Temperaturen!$B$6+(P113/2)","v":61.335557641045909},null,{"$f":"Temperaturen!$B$2+Temperaturen!$B$6+(R113/2)","v":60},{"$f":"Temperaturen!$B$2+Temperaturen!$B$6+(S113/2)","v":60},{"$f":"Temperaturen!$B$2+Temperaturen!$B$6+(T113/2)","v":60},{"$f":"Temperaturen!$B$2+Temperaturen!$B$6+(U113/2)","v":60},{"$f":"Temperaturen!$B$2+Temperaturen!$B$6+(V113/2)","v":60.400678216252622},{"$f":"Temperaturen!$B$2+Temperaturen!$B$6+(W113/2)","v":60.170574068128282}]
[null,null,"Solar RL Temperatur (°C) > ",{"$f":"$B$2+$B$6-(D113/2)","v":58.161238183135133},58.350816860352523,58.210069721701664,58.378174980694979,57.993239558306676,58.284161524453637,null,{"$f":"Temperaturen!$B$2+Temperaturen!$B$6-(K113/2)","v":58.612683591541625},{"$f":"Temperaturen!$B$2+Temperaturen!$B$6-(L113/2)","v":58.774325686599298},{"$f":"Temperaturen!$B$2+Temperaturen!$B$6-(M113/2)","v":58.651416207468124},{"$f":"Temperaturen!$B$2+Temperaturen!$B$6-(N113/2)","v":58.804069959097859},{"$f":"Temperaturen!$B$2+Temperaturen!$B$6-(O113/2)","v":58.399615056741311},{"$f":"Temperaturen!$B$2+Temperaturen!$B$6-(P113/2)","v":58.664442358954091},null,{"$f":"Temperaturen!$B$2+Temperaturen!$B$6-(R113/2)","v":60},{"$f":"Temperaturen!$B$2+Temperaturen!$B$6-(S113/2)","v":60},{"$f":"Temperaturen!$B$2+Temperaturen!$B$6-(T113/2)","v":60},{"$f":"Temperaturen!$B$2+Temperaturen!$B$6-(U113/2)","v":60},{"$f":"Temperaturen!$B$2+Temperaturen!$B$6-(V113/2)","v":59.599321783747378},{"$f":"Temperaturen!$B$2+Temperaturen!$B$6-(W113/2)","v":59.829425931871718}]
["mittel wolkig Azimut > ",-30,"Diff. Solarkreis (K) > ",{"$f":"Sommer!D90/(3.7*($B$9/3600))","v":4.0185787963378381},{"$f":"Sommer!E90/(3.7*($B$9/3600))","v":3.5441797700587561},{"$f":"Sommer!F90/(3.7*($B$9/3600))","v":3.8386823030982189},{"$f":"Sommer!G90/(3.7*($B$9/3600))","v":3.4880288387698051},{"$f":"Sommer!H90/(3.7*($B$9/3600))","v":4.1850519598345288},{"$f":"Sommer!I90/(3.7*($B$9/3600))","v":3.1873972248803835},null,{"$f":"Herbstfrühjahr!D90/(3.7*(Temperaturen!$B$9/3600))","v":3.442823790012973},{"$f":"Herbstfrühjahr!E90/(3.7*(Temperaturen!$B$9/3600))","v":3.0212738141856645},{"$f":"Herbstfrühjahr!F90/(3.7*(Temperaturen!$B$9/3600))","v":3.2956144959156233},{"$f":"Herbstfrühjahr!G90/(3.7*(Temperaturen!$B$9/3600))","v":2.9589332849804295},{"$f":"Herbstfrühjahr!H90/(3.7*(Temperaturen!$B$9/3600))","v":3.6418497973833435},{"$f":"Herbstfrühjahr!I90/(3.7*(Temperaturen!$B$9/3600))","v":2.7529516698264578},null,{"$f":"Winter!D90/(3.7*(Temperaturen!$B$9/3600))","v":0.91912471914405458},{"$f":"Winter!E90/(3.7*(Temperaturen!$B$9/3600))","v":0.67998242135840226},{"$f":"Winter!F90/(3.7*(Temperaturen!$B$9/3600))","v":0.8444637130995386},{"$f":"Winter!G90/(3.7*(Temperaturen!$B$9/3600))","v":0.61961856572600205},{"$f":"Winter!H90/(3.7*(Temperaturen!$B$9/3600))","v":1.5881939846111419},{"$f":"Winter!I90/(3.7*(Temperaturen!$B$9/3600))","v":0.99757647478262002}]
[null,null,"Solar VL Temperatur (°C) > ",{"$f":"$B$2+$B$6+(D116/2)","v":62.009289398168917},61.772089885029381,61.919341151549112,61.744014419384904,62.092525979917262,61.593698612440193,null,{"$f":"Temperaturen!$B$2+Temperaturen!$B$6+(K116/2)","v":61.721411895006483},{"$f":"Temperaturen!$B$2+Temperaturen!$B$6+(L116/2)","v":61.510636907092831},{"$f":"Temperaturen!$B$2+Temperaturen!$B$6+(M116/2)","v":61.647807247957815},{"$f":"Temperaturen!$B$2+Temperaturen!$B$6+(N116/2)","v":61.479466642490216},{"$f":"Temperaturen!$B$2+Temperaturen!$B$6+(O116/2)","v":61.820924898691672},{"$f":"Temperaturen!$B$2+Temperaturen!$B$6+(P116/2)","v":61.376475834913229},null,{"$f":"Temperaturen!$B$2+Temperaturen!$B$6+(R116/2)","v":60.459562359572026},{"$f":"Temperaturen!$B$2+Temperaturen!$B$6+(S116/2)","v":60.339991210679202},{"$f":"Temperaturen!$B$2+Temperaturen!$B$6+(T116/2)","v":60.422231856549772},{"$f":"Temperaturen!$B$2+Temperaturen!$B$6+(U116/2)","v":60.309809282863},{"$f":"Temperaturen!$B$2+Temperaturen!$B$6+(V116/2)","v":60.794096992305569},{"$f":"Temperaturen!$B$2+Temperaturen!$B$6+(W116/2)","v":60.49878823739131}]
[null,null,"Solar RL Temperatur (°C) > ",{"$f":"$B$2+$B$6-(D116/2)","v":57.990710601831083},58.227910114970619,58.080658848450888,58.255985580615096,57.907474020082738,58.406301387559807,null,{"$f":"Temperaturen!$B$2+Temperaturen!$B$6-(K116/2)","v":58.278588104993517},{"$f":"Temperaturen!$B$2+Temperaturen!$B$6-(L116/2)","v":58.489363092907169},{"$f":"Temperaturen!$B$2+Temperaturen!$B$6-(M116/2)","v":58.352192752042185},{"$f":"Temperaturen!$B$2+Temperaturen!$B$6-(N116/2)","v":58.520533357509784},{"$f":"Temperaturen!$B$2+Temperaturen!$B$6-(O116/2)","v":58.179075101308328},{"$f":"Temperaturen!$B$2+Temperaturen!$B$6-(P116/2)","v":58.623524165086771},null,{"$f":"Temperaturen!$B$2+Temperaturen!$B$6-(R116/2)","v":59.540437640427974},{"$f":"Temperaturen!$B$2+Temperaturen!$B$6-(S116/2)","v":59.660008789320798},{"$f":"Temperaturen!$B$2+Temperaturen!$B$6-(T116/2)","v":59.577768143450228},{"$f":"Temperaturen!$B$2+Temperaturen!$B$6-(U116/2)","v":59.690190717137},{"$f":"Temperaturen!$B$2+Temperaturen!$B$6-(V116/2)","v":59.205903007694431},{"$f":"Temperaturen!$B$2+Temperaturen!$B$6-(W116/2)","v":59.50121176260869}]
["mittel wolkig Azimut > ",-20,"Diff. Solarkreis (K) > ",{"$f":"Sommer!D91/(3.7*($B$9/3600))","v":4.2027467229729742},{"$f":"Sommer!E91/(3.7*($B$9/3600))","v":3.7148409509753226},{"$f":"Sommer!F91/(3.7*($B$9/3600))","v":4.0187659351596183},{"$f":"Sommer!G91/(3.7*($B$9/3600))","v":3.6575642291039818},{"$f":"Sommer!H91/(3.7*($B$9/3600))","v":4.2507845181742976},{"$f":"Sommer!I91/(3.7*($B$9/3600))","v":2.9687395279699995},null,{"$f":"Herbstfrühjahr!D91/(3.7*(Temperaturen!$B$9/3600))","v":3.8887498770810836},{"$f":"Herbstfrühjahr!E91/(3.7*(Temperaturen!$B$9/3600))","v":3.437251007774385},{"$f":"Herbstfrühjahr!F91/(3.7*(Temperaturen!$B$9/3600))","v":3.7327679644508911},{"$f":"Herbstfrühjahr!G91/(3.7*(Temperaturen!$B$9/3600))","v":3.3726912698367739},{"$f":"Herbstfrühjahr!H91/(3.7*(Temperaturen!$B$9/3600))","v":3.9118743062151138},{"$f":"Herbstfrühjahr!I91/(3.7*(Temperaturen!$B$9/3600))","v":2.7365394005096086},null,{"$f":"Winter!D91/(3.7*(Temperaturen!$B$9/3600))","v":1.6041959776216219},{"$f":"Winter!E91/(3.7*(Temperaturen!$B$9/3600))","v":1.3199696179741485},{"$f":"Winter!F91/(3.7*(Temperaturen!$B$9/3600))","v":1.5163344640263681},{"$f":"Winter!G91/(3.7*(Temperaturen!$B$9/3600))","v":1.2563877724808952},{"$f":"Winter!H91/(3.7*(Temperaturen!$B$9/3600))","v":2.0751350350656379},{"$f":"Winter!I91/(3.7*(Temperaturen!$B$9/3600))","v":1.3079957565492308}]
[null,null,"Solar VL Temperatur (°C) > ",{"$f":"$B$2+$B$6+(D119/2)","v":62.101373361486488},61.857420475487665,62.00938296757981,61.828782114551991,62.12539225908715,61.484369763985001,null,{"$f":"Temperaturen!$B$2+Temperaturen!$B$6+(K119/2)","v":61.944374938540541},{"$f":"Temperaturen!$B$2+Temperaturen!$B$6+(L119/2)","v":61.718625503887189},{"$f":"Temperaturen!$B$2+Temperaturen!$B$6+(M119/2)","v":61.866383982225443},{"$f":"Temperaturen!$B$2+Temperaturen!$B$6+(N119/2)","v":61.686345634918389},{"$f":"Temperaturen!$B$2+Temperaturen!$B$6+(O119/2)","v":61.955937153107556},{"$f":"Temperaturen!$B$2+Temperaturen!$B$6+(P119/2)","v":61.368269700254807},null,{"$f":"Temperaturen!$B$2+Temperaturen!$B$6+(R119/2)","v":60.802097988810814},{"$f":"Temperaturen!$B$2+Temperaturen!$B$6+(S119/2)","v":60.659984808987076},{"$f":"Temperaturen!$B$2+Temperaturen!$B$6+(T119/2)","v":60.758167232013186},{"$f":"Temperaturen!$B$2+Temperaturen!$B$6+(U119/2)","v":60.628193886240446},{"$f":"Temperaturen!$B$2+Temperaturen!$B$6+(V119/2)","v":61.037567517532821},{"$f":"Temperaturen!$B$2+Temperaturen!$B$6+(W119/2)","v":60.653997878274616}]
[null,null,"Solar RL Temperatur (°C) > ",{"$f":"$B$2+$B$6-(D119/2)","v":57.898626638513512},58.142579524512335,57.99061703242019,58.171217885448009,57.87460774091285,58.515630236014999,null,{"$f":"Temperaturen!$B$2+Temperaturen!$B$6-(K119/2)","v":58.055625061459459},{"$f":"Temperaturen!$B$2+Temperaturen!$B$6-(L119/2)","v":58.281374496112811},{"$f":"Temperaturen!$B$2+Temperaturen!$B$6-(M119/2)","v":58.133616017774557},{"$f":"Temperaturen!$B$2+Temperaturen!$B$6-(N119/2)","v":58.313654365081611},{"$f":"Temperaturen!$B$2+Temperaturen!$B$6-(O119/2)","v":58.044062846892444},{"$f":"Temperaturen!$B$2+Temperaturen!$B$6-(P119/2)","v":58.631730299745193},null,{"$f":"Temperaturen!$B$2+Temperaturen!$B$6-(R119/2)","v":59.197902011189186},{"$f":"Temperaturen!$B$2+Temperaturen!$B$6-(S119/2)","v":59.340015191012924},{"$f":"Temperaturen!$B$2+Temperaturen!$B$6-(T119/2)","v":59.241832767986814},{"$f":"Temperaturen!$B$2+Temperaturen!$B$6-(U119/2)","v":59.371806113759554},{"$f":"Temperaturen!$B$2+Temperaturen!$B$6-(V119/2)","v":58.962432482467179},{"$f":"Temperaturen!$B$2+Temperaturen!$B$6-(W119/2)","v":59.346002121725384}]
["mittel wolkig Azimut > ",-10,"Diff. Solarkreis (K) > ",{"$f":"Sommer!D92/(3.7*($B$9/3600))","v":4.2875872175675687},{"$f":"Sommer!E92/(3.7*($B$9/3600))","v":3.8326423313748537},{"$f":"Sommer!F92/(3.7*($B$9/3600))","v":4.1434676231283545},{"$f":"Sommer!G92/(3.7*($B$9/3600))","v":3.7744570896019178},{"$f":"Sommer!H92/(3.7*($B$9/3600))","v":4.313871437887479},{"$f":"Sommer!I92/(3.7*($B$9/3600))","v":2.9035480206905477},null,{"$f":"Herbstfrühjahr!D92/(3.7*(Temperaturen!$B$9/3600))","v":4.1106404014054059},{"$f":"Herbstfrühjahr!E92/(3.7*(Temperaturen!$B$9/3600))","v":3.6819278665099886},{"$f":"Herbstfrühjahr!F92/(3.7*(Temperaturen!$B$9/3600))","v":3.9904477029475478},{"$f":"Herbstfrühjahr!G92/(3.7*(Temperaturen!$B$9/3600))","v":3.6158530189854896},{"$f":"Herbstfrühjahr!H92/(3.7*(Temperaturen!$B$9/3600))","v":4.0768708654649766},{"$f":"Herbstfrühjahr!I92/(3.7*(Temperaturen!$B$9/3600))","v":2.7594176233182459},null,{"$f":"Winter!D92/(3.7*(Temperaturen!$B$9/3600))","v":2.1249860905945956},{"$f":"Winter!E92/(3.7*(Temperaturen!$B$9/3600))","v":1.8260844296122216},{"$f":"Winter!F92/(3.7*(Temperaturen!$B$9/3600))","v":2.0479452656558998},{"$f":"Winter!G92/(3.7*(Temperaturen!$B$9/3600))","v":1.7598348525629088},{"$f":"Winter!H92/(3.7*(Temperaturen!$B$9/3600))","v":2.4623916653050202},{"$f":"Winter!I92/(3.7*(Temperaturen!$B$9/3600))","v":1.5584162600801761}]
[null,null,"Solar VL Temperatur (°C) > ",{"$f":"$B$2+$B$6+(D122/2)","v":62.143793608783781},61.916321165687428,62.071733811564179,61.887228544800962,62.156935718943743,61.451774010345275,null,{"$f":"Temperaturen!$B$2+Temperaturen!$B$6+(K122/2)","v":62.055320200702702},{"$f":"Temperaturen!$B$2+Temperaturen!$B$6+(L122/2)","v":61.840963933254997},{"$f":"Temperaturen!$B$2+Temperaturen!$B$6+(M122/2)","v":61.995223851473774},{"$f":"Temperaturen!$B$2+Temperaturen!$B$6+(N122/2)","v":61.807926509492745},{"$f":"Temperaturen!$B$2+Temperaturen!$B$6+(O122/2)","v":62.038435432732491},{"$f":"Temperaturen!$B$2+Temperaturen!$B$6+(P122/2)","v":61.379708811659121},null,{"$f":"Temperaturen!$B$2+Temperaturen!$B$6+(R122/2)","v":61.062493045297295},{"$f":"Temperaturen!$B$2+Temperaturen!$B$6+(S122/2)","v":60.913042214806111},{"$f":"Temperaturen!$B$2+Temperaturen!$B$6+(T122/2)","v":61.023972632827949},{"$f":"Temperaturen!$B$2+Temperaturen!$B$6+(U122/2)","v":60.879917426281452},{"$f":"Temperaturen!$B$2+Temperaturen!$B$6+(V122/2)","v":61.23119583265251},{"$f":"Temperaturen!$B$2+Temperaturen!$B$6+(W122/2)","v":60.779208130040089}]
[null,null,"Solar RL Temperatur (°C) > ",{"$f":"$B$2+$B$6-(D122/2)","v":57.856206391216219},58.083678834312572,57.928266188435821,58.112771455199038,57.843064281056257,58.548225989654725,null,{"$f":"Temperaturen!$B$2+Temperaturen!$B$6-(K122/2)","v":57.944679799297298},{"$f":"Temperaturen!$B$2+Temperaturen!$B$6-(L122/2)","v":58.159036066745003},{"$f":"Temperaturen!$B$2+Temperaturen!$B$6-(M122/2)","v":58.004776148526226},{"$f":"Temperaturen!$B$2+Temperaturen!$B$6-(N122/2)","v":58.192073490507255},{"$f":"Temperaturen!$B$2+Temperaturen!$B$6-(O122/2)","v":57.961564567267509},{"$f":"Temperaturen!$B$2+Temperaturen!$B$6-(P122/2)","v":58.620291188340879},null,{"$f":"Temperaturen!$B$2+Temperaturen!$B$6-(R122/2)","v":58.937506954702705},{"$f":"Temperaturen!$B$2+Temperaturen!$B$6-(S122/2)","v":59.086957785193889},{"$f":"Temperaturen!$B$2+Temperaturen!$B$6-(T122/2)","v":58.976027367172051},{"$f":"Temperaturen!$B$2+Temperaturen!$B$6-(U122/2)","v":59.120082573718548},{"$f":"Temperaturen!$B$2+Temperaturen!$B$6-(V122/2)","v":58.76880416734749},{"$f":"Temperaturen!$B$2+Temperaturen!$B$6-(W122/2)","v":59.220791869959911}]
["mittel wolkig Azimut > ",0,"Diff. Solarkreis (K) > ",{"$f":"Sommer!D93/(3.7*($B$9/3600))","v":4.3071657932432439},{"$f":"Sommer!E93/(3.7*($B$9/3600))","v":3.8511679623971804},{"$f":"Sommer!F93/(3.7*($B$9/3600))","v":4.1628771829739151},{"$f":"Sommer!G93/(3.7*($B$9/3600))","v":3.7929065743576094},{"$f":"Sommer!H93/(3.7*($B$9/3600))","v":4.2855742156646448},{"$f":"Sommer!I93/(3.7*($B$9/3600))","v":2.9148535858269748},null,{"$f":"Herbstfrühjahr!D93/(3.7*(Temperaturen!$B$9/3600))","v":4.1824285122162177},{"$f":"Herbstfrühjahr!E93/(3.7*(Temperaturen!$B$9/3600))","v":3.7498551802585203},{"$f":"Herbstfrühjahr!F93/(3.7*(Temperaturen!$B$9/3600))","v":4.0616160890479325},{"$f":"Herbstfrühjahr!G93/(3.7*(Temperaturen!$B$9/3600))","v":3.6835011297563587},{"$f":"Herbstfrühjahr!H93/(3.7*(Temperaturen!$B$9/3600))","v":4.0893585200220635},{"$f":"Herbstfrühjahr!I93/(3.7*(Temperaturen!$B$9/3600))","v":2.8008713621518169},null,{"$f":"Winter!D93/(3.7*(Temperaturen!$B$9/3600))","v":2.2241842073513514},{"$f":"Winter!E93/(3.7*(Temperaturen!$B$9/3600))","v":1.9199476267920095},{"$f":"Winter!F93/(3.7*(Temperaturen!$B$9/3600))","v":2.1462870355400687},{"$f":"Winter!G93/(3.7*(Temperaturen!$B$9/3600))","v":1.853312241991746},{"$f":"Winter!H93/(3.7*(Temperaturen!$B$9/3600))","v":2.5110443890788745},{"$f":"Winter!I93/(3.7*(Temperaturen!$B$9/3600))","v":1.6156977901047458}]
[null,null,"Solar VL Temperatur (°C) > ",{"$f":"$B$2+$B$6+(D125/2)","v":62.153582896621622},61.925583981198592,62.081438591486958,61.896453287178808,62.142787107832319,61.457426792913488,null,{"$f":"Temperaturen!$B$2+Temperaturen!$B$6+(K125/2)","v":62.09121425610811},{"$f":"Temperaturen!$B$2+Temperaturen!$B$6+(L125/2)","v":61.874927590129261},{"$f":"Temperaturen!$B$2+Temperaturen!$B$6+(M125/2)","v":62.030808044523965},{"$f":"Temperaturen!$B$2+Temperaturen!$B$6+(N125/2)","v":61.841750564878183},{"$f":"Temperaturen!$B$2+Temperaturen!$B$6+(O125/2)","v":62.04467926001103},{"$f":"Temperaturen!$B$2+Temperaturen!$B$6+(P125/2)","v":61.400435681075905},null,{"$f":"Temperaturen!$B$2+Temperaturen!$B$6+(R125/2)","v":61.112092103675678},{"$f":"Temperaturen!$B$2+Temperaturen!$B$6+(S125/2)","v":60.959973813396005},{"$f":"Temperaturen!$B$2+Temperaturen!$B$6+(T125/2)","v":61.073143517770035},{"$f":"Temperaturen!$B$2+Temperaturen!$B$6+(U125/2)","v":60.926656120995872},{"$f":"Temperaturen!$B$2+Temperaturen!$B$6+(V125/2)","v":61.255522194539438},{"$f":"Temperaturen!$B$2+Temperaturen!$B$6+(W125/2)","v":60.807848895052373}]
[null,null,"Solar RL Temperatur (°C) > ",{"$f":"$B$2+$B$6-(D125/2)","v":57.846417103378378},58.074416018801408,57.918561408513042,58.103546712821192,57.857212892167681,58.542573207086512,null,{"$f":"Temperaturen!$B$2+Temperaturen!$B$6-(K125/2)","v":57.90878574389189},{"$f":"Temperaturen!$B$2+Temperaturen!$B$6-(L125/2)","v":58.125072409870739},{"$f":"Temperaturen!$B$2+Temperaturen!$B$6-(M125/2)","v":57.969191955476035},{"$f":"Temperaturen!$B$2+Temperaturen!$B$6-(N125/2)","v":58.158249435121817},{"$f":"Temperaturen!$B$2+Temperaturen!$B$6-(O125/2)","v":57.95532073998897},{"$f":"Temperaturen!$B$2+Temperaturen!$B$6-(P125/2)","v":58.599564318924095},null,{"$f":"Temperaturen!$B$2+Temperaturen!$B$6-(R125/2)","v":58.887907896324322},{"$f":"Temperaturen!$B$2+Temperaturen!$B$6-(S125/2)","v":59.040026186603995},{"$f":"Temperaturen!$B$2+Temperaturen!$B$6-(T125/2)","v":58.926856482229965},{"$f":"Temperaturen!$B$2+Temperaturen!$B$6-(U125/2)","v":59.073343879004128},{"$f":"Temperaturen!$B$2+Temperaturen!$B$6-(V125/2)","v":58.744477805460562},{"$f":"Temperaturen!$B$2+Temperaturen!$B$6-(W125/2)","v":59.192151104947627}]
["mittel wolkig Azimut > ",10,"Diff. Solarkreis (K) > ",{"$f":"Sommer!D94/(3.7*($B$9/3600))","v":4.2875872175675687},{"$f":"Sommer!E94/(3.7*($B$9/3600))","v":3.8326423313748537},{"$f":"Sommer!F94/(3.7*($B$9/3600))","v":4.1434676231283545},{"$f":"Sommer!G94/(3.7*($B$9/3600))","v":3.7744570896019178},{"$f":"Sommer!H94/(3.7*($B$9/3600))","v":4.313871437887479},{"$f":"Sommer!I94/(3.7*($B$9/3600))","v":2.9035480206905477},null,{"$f":"Herbstfrühjahr!D94/(3.7*(Temperaturen!$B$9/3600))","v":4.1106404014054059},{"$f":"Herbstfrühjahr!E94/(3.7*(Temperaturen!$B$9/3600))","v":3.6819278665099886},{"$f":"Herbstfrühjahr!F94/(3.7*(Temperaturen!$B$9/3600))","v":3.9904477029475478},{"$f":"Herbstfrühjahr!G94/(3.7*(Temperaturen!$B$9/3600))","v":3.6158530189854896},{"$f":"Herbstfrühjahr!H94/(3.7*(Temperaturen!$B$9/3600))","v":4.0768708654649766},{"$f":"Herbstfrühjahr!I94/(3.7*(Temperaturen!$B$9/3600))","v":2.7594176233182459},null,{"$f":"Winter!D94/(3.7*(Temperaturen!$B$9/3600))","v":2.1249860905945956},{"$f":"Winter!E94/(3.7*(Temperaturen!$B$9/3600))","v":1.8260844296122216},{"$f":"Winter!F94/(3.7*(Temperaturen!$B$9/3600))","v":2.0479452656558998},{"$f":"Winter!G94/(3.7*(Temperaturen!$B$9/3600))","v":1.7598348525629088},{"$f":"Winter!H94/(3.7*(Temperaturen!$B$9/3600))","v":2.4623916653050202},{"$f":"Winter!I94/(3.7*(Temperaturen!$B$9/3600))","v":1.5584162600801761}]
[null,null,"Solar VL Temperatur (°C) > ",{"$f":"$B$2+$B$6+(D128/2)","v":62.143793608783781},61.916321165687428,62.071733811564179,61.887228544800962,62.156935718943743,61.451774010345275,null,{"$f":"Temperaturen!$B$2+Temperaturen!$B$6+(K128/2)","v":62.055320200702702},{"$f":"Temperaturen!$B$2+Temperaturen!$B$6+(L128/2)","v":61.840963933254997},{"$f":"Temperaturen!$B$2+Temperaturen!$B$6+(M128/2)","v":61.995223851473774},{"$f":"Temperaturen!$B$2+Temperaturen!$B$6+(N128/2)","v":61.807926509492745},{"$f":"Temperaturen!$B$2+Temperaturen!$B$6+(O128/2)","v":62.038435432732491},{"$f":"Temperaturen!$B$2+Temperaturen!$B$6+(P128/2)","v":61.379708811659121},null,{"$f":"Temperaturen!$B$2+Temperaturen!$B$6+(R128/2)","v":61.062493045297295},{"$f":"Temperaturen!$B$2+Temperaturen!$B$6+(S128/2)","v":60.913042214806111},{"$f":"Temperaturen!$B$2+Temperaturen!$B$6+(T128/2)","v":61.023972632827949},{"$f":"Temperaturen!$B$2+Temperaturen!$B$6+(U128/2)","v":60.879917426281452},{"$f":"Temperaturen!$B$2+Temperaturen!$B$6+(V128/2)","v":61.23119583265251},{"$f":"Temperaturen!$B$2+Temperaturen!$B$6+(W128/2)","v":60.779208130040089}]
[null,null,"Solar RL Temperatur (°C) > ",{"$f":"$B$2+$B$6-(D128/2)","v":57.856206391216219},58.083678834312572,57.928266188435821,58.112771455199038,57.843064281056257,58.548225989654725,null,{"$f":"Temperaturen!$B$2+Temperaturen!$B$6-(K128/2)","v":57.944679799297298},{"$f":"Temperaturen!$B$2+Temperaturen!$B$6-(L128/2)","v":58.159036066745003},{"$f":"Temperaturen!$B$2+Temperaturen!$B$6-(M128/2)","v":58.004776148526226},{"$f":"Temperaturen!$B$2+Temperaturen!$B$6-(N128/2)","v":58.192073490507255},{"$f":"Temperaturen!$B$2+Temperaturen!$B$6-(O128/2)","v":57.961564567267509},{"$f":"Temperaturen!$B$2+Temperaturen!$B$6-(P128/2)","v":58.620291188340879},null,{"$f":"Temperaturen!$B$2+Temperaturen!$B$6-(R128/2)","v":58.937506954702705},{"$f":"Temperaturen!$B$2+Temperaturen!$B$6-(S128/2)","v":59.086957785193889},{"$f":"Temperaturen!$B$2+Temperaturen!$B$6-(T128/2)","v":58.976027367172051},{"$f":"Temperaturen!$B$2+Temperaturen!$B$6-(U128/2)","v":59.120082573718548},{"$f":"Temperaturen!$B$2+Temperaturen!$B$6-(V128/2)","v":58.76880416734749},{"$f":"Temperaturen!$B$2+Temperaturen!$B$6-(W128/2)","v":59.220791869959911}]
["mittel wolkig Azimut > ",20,"Diff. Solarkreis (K) > ",{"$f":"Sommer!D95/(3.7*($B$9/3600))","v":4.2027467229729742},{"$f":"Sommer!E95/(3.7*($B$9/3600))","v":3.7148409509753226},{"$f":"Sommer!F95/(3.7*($B$9/3600))","v":4.0187659351596183},{"$f":"Sommer!G95/(3.7*($B$9/3600))","v":3.6575642291039818},{"$f":"Sommer!H95/(3.7*($B$9/3600))","v":4.2507845181742976},{"$f":"Sommer!I95/(3.7*($B$9/3600))","v":2.9687395279699995},null,{"$f":"Herbstfrühjahr!D95/(3.7*(Temperaturen!$B$9/3600))","v":3.8887498770810836},{"$f":"Herbstfrühjahr!E95/(3.7*(Temperaturen!$B$9/3600))","v":3.437251007774385},{"$f":"Herbstfrühjahr!F95/(3.7*(Temperaturen!$B$9/3600))","v":3.7327679644508911},{"$f":"Herbstfrühjahr!G95/(3.7*(Temperaturen!$B$9/3600))","v":3.3726912698367739},{"$f":"Herbstfrühjahr!H95/(3.7*(Temperaturen!$B$9/3600))","v":3.9118743062151138},{"$f":"Herbstfrühjahr!I95/(3.7*(Temperaturen!$B$9/3600))","v":2.7365394005096086},null,{"$f":"Winter!D95/(3.7*(Temperaturen!$B$9/3600))","v":1.6041959776216219},{"$f":"Winter!E95/(3.7*(Temperaturen!$B$9/3600))","v":1.3199696179741485},{"$f":"Winter!F95/(3.7*(Temperaturen!$B$9/3600))","v":1.5163344640263681},{"$f":"Winter!G95/(3.7*(Temperaturen!$B$9/3600))","v":1.2563877724808952},{"$f":"Winter!H95/(3.7*(Temperaturen!$B$9/3600))","v":2.0751350350656379},{"$f":"Winter!I95/(3.7*(Temperaturen!$B$9/3600))","v":1.3079957565492308}]
[null,null,"Solar VL Temperatur (°C) > ",{"$f":"$B$2+$B$6+(D131/2)","v":62.101373361486488},61.857420475487665,62.00938296757981,61.828782114551991,62.12539225908715,61.484369763985001,null,{"$f":"Temperaturen!$B$2+Temperaturen!$B$6+(K131/2)","v":61.944374938540541},{"$f":"Temperaturen!$B$2+Temperaturen!$B$6+(L131/2)","v":61.718625503887189},{"$f":"Temperaturen!$B$2+Temperaturen!$B$6+(M131/2)","v":61.866383982225443},{"$f":"Temperaturen!$B$2+Temperaturen!$B$6+(N131/2)","v":61.686345634918389},{"$f":"Temperaturen!$B$2+Temperaturen!$B$6+(O131/2)","v":61.955937153107556},{"$f":"Temperaturen!$B$2+Temperaturen!$B$6+(P131/2)","v":61.368269700254807},null,{"$f":"Temperaturen!$B$2+Temperaturen!$B$6+(R131/2)","v":60.802097988810814},{"$f":"Temperaturen!$B$2+Temperaturen!$B$6+(S131/2)","v":60.659984808987076},{"$f":"Temperaturen!$B$2+Temperaturen!$B$6+(T131/2)","v":60.758167232013186},{"$f":"Temperaturen!$B$2+Temperaturen!$B$6+(U131/2)","v":60.628193886240446},{"$f":"Temperaturen!$B$2+Temperaturen!$B$6+(V131/2)","v":61.037567517532821},{"$f":"Temperaturen!$B$2+Temperaturen!$B$6+(W131/2)","v":60.653997878274616}]
[null,null,"Solar RL Temperatur (°C) > ",{"$f":"$B$2+$B$6-(D131/2)","v":57.898626638513512},58.142579524512335,57.99061703242019,58.171217885448009,57.87460774091285,58.515630236014999,null,{"$f":"Temperaturen!$B$2+Temperaturen!$B$6-(K131/2)","v":58.055625061459459},{"$f":"Temperaturen!$B$2+Temperaturen!$B$6-(L131/2)","v":58.281374496112811},{"$f":"Temperaturen!$B$2+Temperaturen!$B$6-(M131/2)","v":58.133616017774557},{"$f":"Temperaturen!$B$2+Temperaturen!$B$6-(N131/2)","v":58.313654365081611},{"$f":"Temperaturen!$B$2+Temperaturen!$B$6-(O131/2)","v":58.044062846892444},{"$f":"Temperaturen!$B$2+Temperaturen!$B$6-(P131/2)","v":58.631730299745193},null,{"$f":"Temperaturen!$B$2+Temperaturen!$B$6-(R131/2)","v":59.197902011189186},{"$f":"Temperaturen!$B$2+Temperaturen!$B$6-(S131/2)","v":59.340015191012924},{"$f":"Temperaturen!$B$2+Temperaturen!$B$6-(T131/2)","v":59.241832767986814},{"$f":"Temperaturen!$B$2+Temperaturen!$B$6-(U131/2)","v":59.371806113759554},{"$f":"Temperaturen!$B$2+Temperaturen!$B$6-(V131/2)","v":58.962432482467179},{"$f":"Temperaturen!$B$2+Temperaturen!$B$6-(W131/2)","v":59.346002121725384}]
["mittel wolkig Azimut > ",30,"Diff. Solarkreis (K) > ",{"$f":"Sommer!D96/(3.7*($B$9/3600))","v":4.0185787963378381},{"$f":"Sommer!E96/(3.7*($B$9/3600))","v":3.5441797700587561},{"$f":"Sommer!F96/(3.7*($B$9/3600))","v":3.8386823030982189},{"$f":"Sommer!G96/(3.7*($B$9/3600))","v":3.4880288387698051},{"$f":"Sommer!H96/(3.7*($B$9/3600))","v":4.1850519598345288},{"$f":"Sommer!I96/(3.7*($B$9/3600))","v":3.1873972248803835},null,{"$f":"Herbstfrühjahr!D96/(3.7*(Temperaturen!$B$9/3600))","v":3.442823790012973},{"$f":"Herbstfrühjahr!E96/(3.7*(Temperaturen!$B$9/3600))","v":3.0212738141856645},{"$f":"Herbstfrühjahr!F96/(3.7*(Temperaturen!$B$9/3600))","v":3.2956144959156233},{"$f":"Herbstfrühjahr!G96/(3.7*(Temperaturen!$B$9/3600))","v":2.9589332849804295},{"$f":"Herbstfrühjahr!H96/(3.7*(Temperaturen!$B$9/3600))","v":3.6418497973833435},{"$f":"Herbstfrühjahr!I96/(3.7*(Temperaturen!$B$9/3600))","v":2.7529516698264578},null,{"$f":"Winter!D96/(3.7*(Temperaturen!$B$9/3600))","v":0.91912471914405458},{"$f":"Winter!E96/(3.7*(Temperaturen!$B$9/3600))","v":0.67998242135840226},{"$f":"Winter!F96/(3.7*(Temperaturen!$B$9/3600))","v":0.8444637130995386},{"$f":"Winter!G96/(3.7*(Temperaturen!$B$9/3600))","v":0.61961856572600205},{"$f":"Winter!H96/(3.7*(Temperaturen!$B$9/3600))","v":1.5881939846111419},{"$f":"Winter!I96/(3.7*(Temperaturen!$B$9/3600))","v":0.99757647478262002}]
[null,null,"Solar VL Temperatur (°C) > ",{"$f":"$B$2+$B$6+(D134/2)","v":62.009289398168917},61.772089885029381,61.919341151549112,61.744014419384904,62.092525979917262,61.593698612440193,null,{"$f":"Temperaturen!$B$2+Temperaturen!$B$6+(K134/2)","v":61.721411895006483},{"$f":"Temperaturen!$B$2+Temperaturen!$B$6+(L134/2)","v":61.510636907092831},{"$f":"Temperaturen!$B$2+Temperaturen!$B$6+(M134/2)","v":61.647807247957815},{"$f":"Temperaturen!$B$2+Temperaturen!$B$6+(N134/2)","v":61.479466642490216},{"$f":"Temperaturen!$B$2+Temperaturen!$B$6+(O134/2)","v":61.820924898691672},{"$f":"Temperaturen!$B$2+Temperaturen!$B$6+(P134/2)","v":61.376475834913229},null,{"$f":"Temperaturen!$B$2+Temperaturen!$B$6+(R134/2)","v":60.459562359572026},{"$f":"Temperaturen!$B$2+Temperaturen!$B$6+(S134/2)","v":60.339991210679202},{"$f":"Temperaturen!$B$2+Temperaturen!$B$6+(T134/2)","v":60.422231856549772},{"$f":"Temperaturen!$B$2+Temperaturen!$B$6+(U134/2)","v":60.309809282863},{"$f":"Temperaturen!$B$2+Temperaturen!$B$6+(V134/2)","v":60.794096992305569},{"$f":"Temperaturen!$B$2+Temperaturen!$B$6+(W134/2)","v":60.49878823739131}]
[null,null,"Solar RL Temperatur (°C) > ",{"$f":"$B$2+$B$6-(D134/2)","v":57.990710601831083},58.227910114970619,58.080658848450888,58.255985580615096,57.907474020082738,58.406301387559807,null,{"$f":"Temperaturen!$B$2+Temperaturen!$B$6-(K134/2)","v":58.278588104993517},{"$f":"Temperaturen!$B$2+Temperaturen!$B$6-(L134/2)","v":58.489363092907169},{"$f":"Temperaturen!$B$2+Temperaturen!$B$6-(M134/2)","v":58.352192752042185},{"$f":"Temperaturen!$B$2+Temperaturen!$B$6-(N134/2)","v":58.520533357509784},{"$f":"Temperaturen!$B$2+Temperaturen!$B$6-(O134/2)","v":58.179075101308328},{"$f":"Temperaturen!$B$2+Temperaturen!$B$6-(P134/2)","v":58.623524165086771},null,{"$f":"Temperaturen!$B$2+Temperaturen!$B$6-(R134/2)","v":59.540437640427974},{"$f":"Temperaturen!$B$2+Temperaturen!$B$6-(S134/2)","v":59.660008789320798},{"$f":"Temperaturen!$B$2+Temperaturen!$B$6-(T134/2)","v":59.577768143450228},{"$f":"Temperaturen!$B$2+Temperaturen!$B$6-(U134/2)","v":59.690190717137},{"$f":"Temperaturen!$B$2+Temperaturen!$B$6-(V134/2)","v":59.205903007694431},{"$f":"Temperaturen!$B$2+Temperaturen!$B$6-(W134/2)","v":59.50121176260869}]
["mittel wolkig Azimut > ",40,"Diff. Solarkreis (K) > ",{"$f":"Sommer!D97/(3.7*($B$9/3600))","v":3.677523633729729},{"$f":"Sommer!E97/(3.7*($B$9/3600))","v":3.2983662792949464},{"$f":"Sommer!F97/(3.7*($B$9/3600))","v":3.5798605565966657},{"$f":"Sommer!G97/(3.7*($B$9/3600))","v":3.2436500386100398},{"$f":"Sommer!H97/(3.7*($B$9/3600))","v":4.0135208833866516},{"$f":"Sommer!I97/(3.7*($B$9/3600))","v":3.4316769510927196},null,{"$f":"Herbstfrühjahr!D97/(3.7*(Temperaturen!$B$9/3600))","v":2.7746328169167569},{"$f":"Herbstfrühjahr!E97/(3.7*(Temperaturen!$B$9/3600))","v":2.4513486268014106},{"$f":"Herbstfrühjahr!F97/(3.7*(Temperaturen!$B$9/3600))","v":2.6971675850637529},{"$f":"Herbstfrühjahr!G97/(3.7*(Temperaturen!$B$9/3600))","v":2.3918600818042881},{"$f":"Herbstfrühjahr!H97/(3.7*(Temperaturen!$B$9/3600))","v":3.2007698865173753},{"$f":"Herbstfrühjahr!I97/(3.7*(Temperaturen!$B$9/3600))","v":2.6711152820918143},null,{"$f":"Winter!D97/(3.7*(Temperaturen!$B$9/3600))","v":0},{"$f":"Winter!E97/(3.7*(Temperaturen!$B$9/3600))","v":0},{"$f":"Winter!F97/(3.7*(Temperaturen!$B$9/3600))","v":0},{"$f":"Winter!G97/(3.7*(Temperaturen!$B$9/3600))","v":0},{"$f":"Winter!H97/(3.7*(Temperaturen!$B$9/3600))","v":0.80135643250524013},{"$f":"Winter!I97/(3.7*(Temperaturen!$B$9/3600))","v":0.34114813625656282}]
[null,null,"Solar VL Temperatur (°C) > ",{"$f":"$B$2+$B$6+(D137/2)","v":61.838761816864867},61.649183139647477,61.789930278298336,61.621825019305021,62.006760441693324,61.715838475546363,null,{"$f":"Temperaturen!$B$2+Temperaturen!$B$6+(K137/2)","v":61.387316408458375},{"$f":"Temperaturen!$B$2+Temperaturen!$B$6+(L137/2)","v":61.225674313400702},{"$f":"Temperaturen!$B$2+Temperaturen!$B$6+(M137/2)","v":61.348583792531876},{"$f":"Temperaturen!$B$2+Temperaturen!$B$6+(N137/2)","v":61.195930040902141},{"$f":"Temperaturen!$B$2+Temperaturen!$B$6+(O137/2)","v":61.600384943258689},{"$f":"Temperaturen!$B$2+Temperaturen!$B$6+(P137/2)","v":61.335557641045909},null,{"$f":"Temperaturen!$B$2+Temperaturen!$B$6+(R137/2)","v":60},{"$f":"Temperaturen!$B$2+Temperaturen!$B$6+(S137/2)","v":60},{"$f":"Temperaturen!$B$2+Temperaturen!$B$6+(T137/2)","v":60},{"$f":"Temperaturen!$B$2+Temperaturen!$B$6+(U137/2)","v":60},{"$f":"Temperaturen!$B$2+Temperaturen!$B$6+(V137/2)","v":60.400678216252622},{"$f":"Temperaturen!$B$2+Temperaturen!$B$6+(W137/2)","v":60.170574068128282}]
[null,null,"Solar RL Temperatur (°C) > ",{"$f":"$B$2+$B$6-(D137/2)","v":58.161238183135133},58.350816860352523,58.210069721701664,58.378174980694979,57.993239558306676,58.284161524453637,null,{"$f":"Temperaturen!$B$2+Temperaturen!$B$6-(K137/2)","v":58.612683591541625},{"$f":"Temperaturen!$B$2+Temperaturen!$B$6-(L137/2)","v":58.774325686599298},{"$f":"Temperaturen!$B$2+Temperaturen!$B$6-(M137/2)","v":58.651416207468124},{"$f":"Temperaturen!$B$2+Temperaturen!$B$6-(N137/2)","v":58.804069959097859},{"$f":"Temperaturen!$B$2+Temperaturen!$B$6-(O137/2)","v":58.399615056741311},{"$f":"Temperaturen!$B$2+Temperaturen!$B$6-(P137/2)","v":58.664442358954091},null,{"$f":"Temperaturen!$B$2+Temperaturen!$B$6-(R137/2)","v":60},{"$f":"Temperaturen!$B$2+Temperaturen!$B$6-(S137/2)","v":60},{"$f":"Temperaturen!$B$2+Temperaturen!$B$6-(T137/2)","v":60},{"$f":"Temperaturen!$B$2+Temperaturen!$B$6-(U137/2)","v":60},{"$f":"Temperaturen!$B$2+Temperaturen!$B$6-(V137/2)","v":59.599321783747378},{"$f":"Temperaturen!$B$2+Temperaturen!$B$6-(W137/2)","v":59.829425931871718}]
["mittel wolkig Azimut > ",50,"Diff. Solarkreis (K) > ",{"$f":"Sommer!D98/(3.7*($B$9/3600))","v":3.2635044372162163},{"$f":"Sommer!E98/(3.7*($B$9/3600))","v":2.8770965764512346},{"$f":"Sommer!F98/(3.7*($B$9/3600))","v":3.1346518051228918},{"$f":"Sommer!G98/(3.7*($B$9/3600))","v":2.8554421302090272},{"$f":"Sommer!H98/(3.7*($B$9/3600))","v":3.5971496156756757},{"$f":"Sommer!I98/(3.7*($B$9/3600))","v":3.3081766170748748},null,{"$f":"Herbstfrühjahr!D98/(3.7*(Temperaturen!$B$9/3600))","v":2.1831159936454054},{"$f":"Herbstfrühjahr!E98/(3.7*(Temperaturen!$B$9/3600))","v":1.8705250191492366},{"$f":"Herbstfrühjahr!F98/(3.7*(Temperaturen!$B$9/3600))","v":2.0846454294965624},{"$f":"Herbstfrühjahr!G98/(3.7*(Temperaturen!$B$9/3600))","v":1.8342600740673685},{"$f":"Herbstfrühjahr!H98/(3.7*(Temperaturen!$B$9/3600))","v":2.6655929280000006},{"$f":"Herbstfrühjahr!I98/(3.7*(Temperaturen!$B$9/3600))","v":2.3485060368999355},null,{"$f":"Winter!D98/(3.7*(Temperaturen!$B$9/3600))","v":0},{"$f":"Winter!E98/(3.7*(Temperaturen!$B$9/3600))","v":0},{"$f":"Winter!F98/(3.7*(Temperaturen!$B$9/3600))","v":0},{"$f":"Winter!G98/(3.7*(Temperaturen!$B$9/3600))","v":0},{"$f":"Winter!H98/(3.7*(Temperaturen!$B$9/3600))","v":6.3155388000000007E-2},{"$f":"Winter!I98/(3.7*(Temperaturen!$B$9/3600))","v":0}]
[null,null,"Solar VL Temperatur (°C) > ",{"$f":"$B$2+$B$6+(D140/2)","v":61.631752218608106},61.438548288225618,61.567325902561443,61.427721065104514,61.798574807837838,61.654088308537439,null,{"$f":"Temperaturen!$B$2+Temperaturen!$B$6+(K140/2)","v":61.091557996822701},{"$f":"Temperaturen!$B$2+Temperaturen!$B$6+(L140/2)","v":60.935262509574621},{"$f":"Temperaturen!$B$2+Temperaturen!$B$6+(M140/2)","v":61.042322714748281},{"$f":"Temperaturen!$B$2+Temperaturen!$B$6+(N140/2)","v":60.917130037033687},{"$f":"Temperaturen!$B$2+Temperaturen!$B$6+(O140/2)","v":61.332796463999998},{"$f":"Temperaturen!$B$2+Temperaturen!$B$6+(P140/2)","v":61.174253018449967},null,{"$f":"Temperaturen!$B$2+Temperaturen!$B$6+(R140/2)","v":60},{"$f":"Temperaturen!$B$2+Temperaturen!$B$6+(S140/2)","v":60},{"$f":"Temperaturen!$B$2+Temperaturen!$B$6+(T140/2)","v":60},{"$f":"Temperaturen!$B$2+Temperaturen!$B$6+(U140/2)","v":60},{"$f":"Temperaturen!$B$2+Temperaturen!$B$6+(V140/2)","v":60.031577693999999},{"$f":"Temperaturen!$B$2+Temperaturen!$B$6+(W140/2)","v":60}]
[null,null,"Solar RL Temperatur (°C) > ",{"$f":"$B$2+$B$6-(D140/2)","v":58.368247781391894},58.561451711774382,58.432674097438557,58.572278934895486,58.201425192162162,58.345911691462561,null,{"$f":"Temperaturen!$B$2+Temperaturen!$B$6-(K140/2)","v":58.908442003177299},{"$f":"Temperaturen!$B$2+Temperaturen!$B$6-(L140/2)","v":59.064737490425379},{"$f":"Temperaturen!$B$2+Temperaturen!$B$6-(M140/2)","v":58.957677285251719},{"$f":"Temperaturen!$B$2+Temperaturen!$B$6-(N140/2)","v":59.082869962966313},{"$f":"Temperaturen!$B$2+Temperaturen!$B$6-(O140/2)","v":58.667203536000002},{"$f":"Temperaturen!$B$2+Temperaturen!$B$6-(P140/2)","v":58.825746981550033},null,{"$f":"Temperaturen!$B$2+Temperaturen!$B$6-(R140/2)","v":60},{"$f":"Temperaturen!$B$2+Temperaturen!$B$6-(S140/2)","v":60},{"$f":"Temperaturen!$B$2+Temperaturen!$B$6-(T140/2)","v":60},{"$f":"Temperaturen!$B$2+Temperaturen!$B$6-(U140/2)","v":60},{"$f":"Temperaturen!$B$2+Temperaturen!$B$6-(V140/2)","v":59.968422306000001},{"$f":"Temperaturen!$B$2+Temperaturen!$B$6-(W140/2)","v":60}]
["mittel wolkig Azimut > ",60,"Diff. Solarkreis (K) > ",{"$f":"Sommer!D99/(3.7*($B$9/3600))","v":2.5423699015945953},{"$f":"Sommer!E99/(3.7*($B$9/3600))","v":2.3156094796709756},{"$f":"Sommer!F99/(3.7*($B$9/3600))","v":2.5412557982672563},{"$f":"Sommer!G99/(3.7*($B$9/3600))","v":2.2679029135933972},{"$f":"Sommer!H99/(3.7*($B$9/3600))","v":3.4555313727799235},{"$f":"Sommer!I99/(3.7*($B$9/3600))","v":2.8605912524939874},null,{"$f":"Herbstfrühjahr!D99/(3.7*(Temperaturen!$B$9/3600))","v":1.2508530592086489},{"$f":"Herbstfrühjahr!E99/(3.7*(Temperaturen!$B$9/3600))","v":1.0517555320329028},{"$f":"Herbstfrühjahr!F99/(3.7*(Temperaturen!$B$9/3600))","v":1.2214956755099349},{"$f":"Herbstfrühjahr!G99/(3.7*(Temperaturen!$B$9/3600))","v":1.0015856284169884},{"$f":"Herbstfrühjahr!H99/(3.7*(Temperaturen!$B$9/3600))","v":2.185003212046333},{"$f":"Herbstfrühjahr!I99/(3.7*(Temperaturen!$B$9/3600))","v":1.6423432438780294},null,{"$f":"Winter!D99/(3.7*(Temperaturen!$B$9/3600))","v":0},{"$f":"Winter!E99/(3.7*(Temperaturen!$B$9/3600))","v":0},{"$f":"Winter!F99/(3.7*(Temperaturen!$B$9/3600))","v":0},{"$f":"Winter!G99/(3.7*(Temperaturen!$B$9/3600))","v":0},{"$f":"Winter!H99/(3.7*(Temperaturen!$B$9/3600))","v":0},{"$f":"Winter!I99/(3.7*(Temperaturen!$B$9/3600))","v":0}]
[null,null,"Solar VL Temperatur (°C) > ",{"$f":"$B$2+$B$6+(D143/2)","v":61.271184950797299},61.157804739835491,61.270627899133629,61.133951456796702,61.727765686389965,61.430295626246995,null,{"$f":"Temperaturen!$B$2+Temperaturen!$B$6+(K143/2)","v":60.625426529604326},{"$f":"Temperaturen!$B$2+Temperaturen!$B$6+(L143/2)","v":60.52587776601645},{"$f":"Temperaturen!$B$2+Temperaturen!$B$6+(M143/2)","v":60.610747837754964},{"$f":"Temperaturen!$B$2+Temperaturen!$B$6+(N143/2)","v":60.500792814208495},{"$f":"Temperaturen!$B$2+Temperaturen!$B$6+(O143/2)","v":61.09250160602317},{"$f":"Temperaturen!$B$2+Temperaturen!$B$6+(P143/2)","v":60.821171621939015},null,{"$f":"Temperaturen!$B$2+Temperaturen!$B$6+(R143/2)","v":60},{"$f":"Temperaturen!$B$2+Temperaturen!$B$6+(S143/2)","v":60},{"$f":"Temperaturen!$B$2+Temperaturen!$B$6+(T143/2)","v":60},{"$f":"Temperaturen!$B$2+Temperaturen!$B$6+(U143/2)","v":60},{"$f":"Temperaturen!$B$2+Temperaturen!$B$6+(V143/2)","v":60},{"$f":"Temperaturen!$B$2+Temperaturen!$B$6+(W143/2)","v":60}]
[null,null,"Solar RL Temperatur (°C) > ",{"$f":"$B$2+$B$6-(D143/2)","v":58.728815049202701},58.842195260164509,58.729372100866371,58.866048543203298,58.272234313610035,58.569704373753005,null,{"$f":"Temperaturen!$B$2+Temperaturen!$B$6-(K143/2)","v":59.374573470395674},{"$f":"Temperaturen!$B$2+Temperaturen!$B$6-(L143/2)","v":59.47412223398355},{"$f":"Temperaturen!$B$2+Temperaturen!$B$6-(M143/2)","v":59.389252162245036},{"$f":"Temperaturen!$B$2+Temperaturen!$B$6-(N143/2)","v":59.499207185791505},{"$f":"Temperaturen!$B$2+Temperaturen!$B$6-(O143/2)","v":58.90749839397683},{"$f":"Temperaturen!$B$2+Temperaturen!$B$6-(P143/2)","v":59.178828378060985},null,{"$f":"Temperaturen!$B$2+Temperaturen!$B$6-(R143/2)","v":60},{"$f":"Temperaturen!$B$2+Temperaturen!$B$6-(S143/2)","v":60},{"$f":"Temperaturen!$B$2+Temperaturen!$B$6-(T143/2)","v":60},{"$f":"Temperaturen!$B$2+Temperaturen!$B$6-(U143/2)","v":60},{"$f":"Temperaturen!$B$2+Temperaturen!$B$6-(V143/2)","v":60},{"$f":"Temperaturen!$B$2+Temperaturen!$B$6-(W143/2)","v":60}]
["mittel wolkig Azimut > ",70,"Diff. Solarkreis (K) > ",{"$f":"Sommer!D100/(3.7*($B$9/3600))","v":1.619712603121622},{"$f":"Sommer!E100/(3.7*($B$9/3600))","v":1.5000805226792011},{"$f":"Sommer!F100/(3.7*($B$9/3600))","v":1.6949445475524998},{"$f":"Sommer!G100/(3.7*($B$9/3600))","v":1.478218842337905},{"$f":"Sommer!H100/(3.7*($B$9/3600))","v":3.1327664633314947},{"$f":"Sommer!I100/(3.7*($B$9/3600))","v":1.8969085681148332},null,{"$f":"Herbstfrühjahr!D100/(3.7*(Temperaturen!$B$9/3600))","v":0.12800308413405409},{"$f":"Herbstfrühjahr!E100/(3.7*(Temperaturen!$B$9/3600))","v":0},{"$f":"Herbstfrühjahr!F100/(3.7*(Temperaturen!$B$9/3600))","v":7.2192200931914391E-2},{"$f":"Herbstfrühjahr!G100/(3.7*(Temperaturen!$B$9/3600))","v":0},{"$f":"Herbstfrühjahr!H100/(3.7*(Temperaturen!$B$9/3600))","v":1.298706464353006},{"$f":"Herbstfrühjahr!I100/(3.7*(Temperaturen!$B$9/3600))","v":0.5405689242947368},null,{"$f":"Winter!D100/(3.7*(Temperaturen!$B$9/3600))","v":0},{"$f":"Winter!E100/(3.7*(Temperaturen!$B$9/3600))","v":0},{"$f":"Winter!F100/(3.7*(Temperaturen!$B$9/3600))","v":0},{"$f":"Winter!G100/(3.7*(Temperaturen!$B$9/3600))","v":0},{"$f":"Winter!H100/(3.7*(Temperaturen!$B$9/3600))","v":0},{"$f":"Winter!I100/(3.7*(Temperaturen!$B$9/3600))","v":0}]
[null,null,"Solar VL Temperatur (°C) > ",{"$f":"$B$2+$B$6+(D146/2)","v":60.809856301560814},60.750040261339599,60.847472273776248,60.739109421168955,61.566383231665746,60.948454284057419,null,{"$f":"Temperaturen!$B$2+Temperaturen!$B$6+(K146/2)","v":60.064001542067025},{"$f":"Temperaturen!$B$2+Temperaturen!$B$6+(L146/2)","v":60},{"$f":"Temperaturen!$B$2+Temperaturen!$B$6+(M146/2)","v":60.036096100465954},{"$f":"Temperaturen!$B$2+Temperaturen!$B$6+(N146/2)","v":60},{"$f":"Temperaturen!$B$2+Temperaturen!$B$6+(O146/2)","v":60.649353232176502},{"$f":"Temperaturen!$B$2+Temperaturen!$B$6+(P146/2)","v":60.270284462147366},null,{"$f":"Temperaturen!$B$2+Temperaturen!$B$6+(R146/2)","v":60},{"$f":"Temperaturen!$B$2+Temperaturen!$B$6+(S146/2)","v":60},{"$f":"Temperaturen!$B$2+Temperaturen!$B$6+(T146/2)","v":60},{"$f":"Temperaturen!$B$2+Temperaturen!$B$6+(U146/2)","v":60},{"$f":"Temperaturen!$B$2+Temperaturen!$B$6+(V146/2)","v":60},{"$f":"Temperaturen!$B$2+Temperaturen!$B$6+(W146/2)","v":60}]
[null,null,"Solar RL Temperatur (°C) > ",{"$f":"$B$2+$B$6-(D146/2)","v":59.190143698439186},59.249959738660401,59.152527726223752,59.260890578831045,58.433616768334254,59.051545715942581,null,{"$f":"Temperaturen!$B$2+Temperaturen!$B$6-(K146/2)","v":59.935998457932975},{"$f":"Temperaturen!$B$2+Temperaturen!$B$6-(L146/2)","v":60},{"$f":"Temperaturen!$B$2+Temperaturen!$B$6-(M146/2)","v":59.963903899534046},{"$f":"Temperaturen!$B$2+Temperaturen!$B$6-(N146/2)","v":60},{"$f":"Temperaturen!$B$2+Temperaturen!$B$6-(O146/2)","v":59.350646767823498},{"$f":"Temperaturen!$B$2+Temperaturen!$B$6-(P146/2)","v":59.729715537852634},null,{"$f":"Temperaturen!$B$2+Temperaturen!$B$6-(R146/2)","v":60},{"$f":"Temperaturen!$B$2+Temperaturen!$B$6-(S146/2)","v":60},{"$f":"Temperaturen!$B$2+Temperaturen!$B$6-(T146/2)","v":60},{"$f":"Temperaturen!$B$2+Temperaturen!$B$6-(U146/2)","v":60},{"$f":"Temperaturen!$B$2+Temperaturen!$B$6-(V146/2)","v":60},{"$f":"Temperaturen!$B$2+Temperaturen!$B$6-(W146/2)","v":60}]
["Detailtemperaturen bei allen Winkelfaktoren",null,null,"Detailtemperaturen Sommer bei stark bewölkt",null,null,null,null,null,null,"Detailtemperaturen Sommer bei stark bewölkt",null,null,null,null,null,null,"Detailtemperaturen Sommer bei stark bewölkt"]
["stark wolkig Azimut > ",-70,"Diff. Solarkreis (K) > ",{"$f":"Sommer!D115/(3.7*($B$9/3600))","v":0},{"$f":"Sommer!E115/(3.7*($B$9/3600))","v":0},{"$f":"Sommer!F115/(3.7*($B$9/3600))","v":0},{"$f":"Sommer!G115/(3.7*($B$9/3600))","v":0},{"$f":"Sommer!H115/(3.7*($B$9/3600))","v":0.34473782412575843},{"$f":"Sommer!I115/(3.7*($B$9/3600))","v":0},null,{"$f":"Herbstfrühjahr!D115/(3.7*(Temperaturen!$B$9/3600))","v":0},{"$f":"Herbstfrühjahr!E115/(3.7*(Temperaturen!$B$9/3600))","v":0},{"$f":"Herbstfrühjahr!F115/(3.7*(Temperaturen!$B$9/3600))","v":0},{"$f":"Herbstfrühjahr!G115/(3.7*(Temperaturen!$B$9/3600))","v":0},{"$f":"Herbstfrühjahr!H115/(3.7*(Temperaturen!$B$9/3600))","v":0.40040254130832859},{"$f":"Herbstfrühjahr!I115/(3.7*(Temperaturen!$B$9/3600))","v":0},null,{"$f":"Winter!D115/(3.7*(Temperaturen!$B$9/3600))","v":0},{"$f":"Winter!E115/(3.7*(Temperaturen!$B$9/3600))","v":0},{"$f":"Winter!F115/(3.7*(Temperaturen!$B$9/3600))","v":0},{"$f":"Winter!G115/(3.7*(Temperaturen!$B$9/3600))","v":0},{"$f":"Winter!H115/(3.7*(Temperaturen!$B$9/3600))","v":0},{"$f":"Winter!I115/(3.7*(Temperaturen!$B$9/3600))","v":0}]
[null,null,"Solar VL Temperatur (°C) > ",{"$f":"$B$2+$B$6+(D150/2)","v":60},60,60,60,60.172368912062879,60,null,{"$f":"Temperaturen!$B$2+Temperaturen!$B$6+(K150/2)","v":60},{"$f":"Temperaturen!$B$2+Temperaturen!$B$6+(L150/2)","v":60},{"$f":"Temperaturen!$B$2+Temperaturen!$B$6+(M150/2)","v":60},{"$f":"Temperaturen!$B$2+Temperaturen!$B$6+(N150/2)","v":60},{"$f":"Temperaturen!$B$2+Temperaturen!$B$6+(O150/2)","v":60.200201270654162},{"$f":"Temperaturen!$B$2+Temperaturen!$B$6+(P150/2)","v":60},null,{"$f":"Temperaturen!$B$2+Temperaturen!$B$6+(R150/2)","v":60},{"$f":"Temperaturen!$B$2+Temperaturen!$B$6+(S150/2)","v":60},{"$f":"Temperaturen!$B$2+Temperaturen!$B$6+(T150/2)","v":60},{"$f":"Temperaturen!$B$2+Temperaturen!$B$6+(U150/2)","v":60},{"$f":"Temperaturen!$B$2+Temperaturen!$B$6+(V150/2)","v":60},{"$f":"Temperaturen!$B$2+Temperaturen!$B$6+(W150/2)","v":60}]
[null,null,"Solar RL Temperatur (°C) > ",{"$f":"$B$2+$B$6-(D150/2)","v":60},60,60,60,59.827631087937121,60,null,{"$f":"Temperaturen!$B$2+Temperaturen!$B$6-(K150/2)","v":60},{"$f":"Temperaturen!$B$2+Temperaturen!$B$6-(L150/2)","v":60},{"$f":"Temperaturen!$B$2+Temperaturen!$B$6-(M150/2)","v":60},{"$f":"Temperaturen!$B$2+Temperaturen!$B$6-(N150/2)","v":60},{"$f":"Temperaturen!$B$2+Temperaturen!$B$6-(O150/2)","v":59.799798729345838},{"$f":"Temperaturen!$B$2+Temperaturen!$B$6-(P150/2)","v":60},null,{"$f":"Temperaturen!$B$2+Temperaturen!$B$6-(R150/2)","v":60},{"$f":"Temperaturen!$B$2+Temperaturen!$B$6-(S150/2)","v":60},{"$f":"Temperaturen!$B$2+Temperaturen!$B$6-(T150/2)","v":60},{"$f":"Temperaturen!$B$2+Temperaturen!$B$6-(U150/2)","v":60},{"$f":"Temperaturen!$B$2+Temperaturen!$B$6-(V150/2)","v":60},{"$f":"Temperaturen!$B$2+Temperaturen!$B$6-(W150/2)","v":60}]
["stark wolkig Azimut > ",-60,"Diff. Solarkreis (K) > ",{"$f":"Sommer!D116/(3.7*($B$9/3600))","v":0.33664756597297313},{"$f":"Sommer!E116/(3.7*($B$9/3600))","v":0.13143758213866052},{"$f":"Sommer!F116/(3.7*($B$9/3600))","v":0.25286869247575067},{"$f":"Sommer!G116/(3.7*($B$9/3600))","v":9.2708660897350484E-2},{"$f":"Sommer!H116/(3.7*($B$9/3600))","v":1.4728339303088807},{"$f":"Sommer!I116/(3.7*($B$9/3600))","v":0.87601234844536402},null,{"$f":"Herbstfrühjahr!D116/(3.7*(Temperaturen!$B$9/3600))","v":0},{"$f":"Herbstfrühjahr!E116/(3.7*(Temperaturen!$B$9/3600))","v":0},{"$f":"Herbstfrühjahr!F116/(3.7*(Temperaturen!$B$9/3600))","v":0},{"$f":"Herbstfrühjahr!G116/(3.7*(Temperaturen!$B$9/3600))","v":0},{"$f":"Herbstfrühjahr!H116/(3.7*(Temperaturen!$B$9/3600))","v":0.86320491706563707},{"$f":"Herbstfrühjahr!I116/(3.7*(Temperaturen!$B$9/3600))","v":0.3192906411789474},null,{"$f":"Winter!D116/(3.7*(Temperaturen!$B$9/3600))","v":0},{"$f":"Winter!E116/(3.7*(Temperaturen!$B$9/3600))","v":0},{"$f":"Winter!F116/(3.7*(Temperaturen!$B$9/3600))","v":0},{"$f":"Winter!G116/(3.7*(Temperaturen!$B$9/3600))","v":0},{"$f":"Winter!H116/(3.7*(Temperaturen!$B$9/3600))","v":0},{"$f":"Winter!I116/(3.7*(Temperaturen!$B$9/3600))","v":0}]
[null,null,"Solar VL Temperatur (°C) > ",{"$f":"$B$2+$B$6+(D153/2)","v":60.168323782986484},60.06571879106933,60.126434346237872,60.046354330448672,60.73641696515444,60.438006174222679,null,{"$f":"Temperaturen!$B$2+Temperaturen!$B$6+(K153/2)","v":60},{"$f":"Temperaturen!$B$2+Temperaturen!$B$6+(L153/2)","v":60},{"$f":"Temperaturen!$B$2+Temperaturen!$B$6+(M153/2)","v":60},{"$f":"Temperaturen!$B$2+Temperaturen!$B$6+(N153/2)","v":60},{"$f":"Temperaturen!$B$2+Temperaturen!$B$6+(O153/2)","v":60.431602458532815},{"$f":"Temperaturen!$B$2+Temperaturen!$B$6+(P153/2)","v":60.159645320589476},null,{"$f":"Temperaturen!$B$2+Temperaturen!$B$6+(R153/2)","v":60},{"$f":"Temperaturen!$B$2+Temperaturen!$B$6+(S153/2)","v":60},{"$f":"Temperaturen!$B$2+Temperaturen!$B$6+(T153/2)","v":60},{"$f":"Temperaturen!$B$2+Temperaturen!$B$6+(U153/2)","v":60},{"$f":"Temperaturen!$B$2+Temperaturen!$B$6+(V153/2)","v":60},{"$f":"Temperaturen!$B$2+Temperaturen!$B$6+(W153/2)","v":60}]
[null,null,"Solar RL Temperatur (°C) > ",{"$f":"$B$2+$B$6-(D153/2)","v":59.831676217013516},59.93428120893067,59.873565653762128,59.953645669551328,59.26358303484556,59.561993825777321,null,{"$f":"Temperaturen!$B$2+Temperaturen!$B$6-(K153/2)","v":60},{"$f":"Temperaturen!$B$2+Temperaturen!$B$6-(L153/2)","v":60},{"$f":"Temperaturen!$B$2+Temperaturen!$B$6-(M153/2)","v":60},{"$f":"Temperaturen!$B$2+Temperaturen!$B$6-(N153/2)","v":60},{"$f":"Temperaturen!$B$2+Temperaturen!$B$6-(O153/2)","v":59.568397541467185},{"$f":"Temperaturen!$B$2+Temperaturen!$B$6-(P153/2)","v":59.840354679410524},null,{"$f":"Temperaturen!$B$2+Temperaturen!$B$6-(R153/2)","v":60},{"$f":"Temperaturen!$B$2+Temperaturen!$B$6-(S153/2)","v":60},{"$f":"Temperaturen!$B$2+Temperaturen!$B$6-(T153/2)","v":60},{"$f":"Temperaturen!$B$2+Temperaturen!$B$6-(U153/2)","v":60},{"$f":"Temperaturen!$B$2+Temperaturen!$B$6-(V153/2)","v":60},{"$f":"Temperaturen!$B$2+Temperaturen!$B$6-(W153/2)","v":60}]
["stark wolkig Azimut > ",-50,"Diff. Solarkreis (K) > ",{"$f":"Sommer!D117/(3.7*($B$9/3600))","v":0.61028112356756803},{"$f":"Sommer!E117/(3.7*($B$9/3600))","v":0.36656481240893068},{"$f":"Sommer!F117/(3.7*($B$9/3600))","v":0.50433295338544115},{"$f":"Sommer!G117/(3.7*($B$9/3600))","v":0.32863144721075777},{"$f":"Sommer!H117/(3.7*($B$9/3600))","v":1.5606385021621625},{"$f":"Sommer!I117/(3.7*($B$9/3600))","v":1.0915321459924998},null,{"$f":"Herbstfrühjahr!D117/(3.7*(Temperaturen!$B$9/3600))","v":0.16789319934810829},{"$f":"Herbstfrühjahr!E117/(3.7*(Temperaturen!$B$9/3600))","v":0},{"$f":"Herbstfrühjahr!F117/(3.7*(Temperaturen!$B$9/3600))","v":8.6819434593087816E-2},{"$f":"Herbstfrühjahr!G117/(3.7*(Temperaturen!$B$9/3600))","v":0},{"$f":"Herbstfrühjahr!H117/(3.7*(Temperaturen!$B$9/3600))","v":1.1187862209729731},{"$f":"Herbstfrühjahr!I117/(3.7*(Temperaturen!$B$9/3600))","v":0.66488127678303399},null,{"$f":"Winter!D117/(3.7*(Temperaturen!$B$9/3600))","v":0},{"$f":"Winter!E117/(3.7*(Temperaturen!$B$9/3600))","v":0},{"$f":"Winter!F117/(3.7*(Temperaturen!$B$9/3600))","v":0},{"$f":"Winter!G117/(3.7*(Temperaturen!$B$9/3600))","v":0},{"$f":"Winter!H117/(3.7*(Temperaturen!$B$9/3600))","v":0},{"$f":"Winter!I117/(3.7*(Temperaturen!$B$9/3600))","v":0}]
[null,null,"Solar VL Temperatur (°C) > ",{"$f":"$B$2+$B$6+(D156/2)","v":60.305140561783787},60.183282406204462,60.252166476692722,60.164315723605377,60.780319251081082,60.545766072996251,null,{"$f":"Temperaturen!$B$2+Temperaturen!$B$6+(K156/2)","v":60.083946599674057},{"$f":"Temperaturen!$B$2+Temperaturen!$B$6+(L156/2)","v":60},{"$f":"Temperaturen!$B$2+Temperaturen!$B$6+(M156/2)","v":60.043409717296541},{"$f":"Temperaturen!$B$2+Temperaturen!$B$6+(N156/2)","v":60},{"$f":"Temperaturen!$B$2+Temperaturen!$B$6+(O156/2)","v":60.559393110486489},{"$f":"Temperaturen!$B$2+Temperaturen!$B$6+(P156/2)","v":60.332440638391517},null,{"$f":"Temperaturen!$B$2+Temperaturen!$B$6+(R156/2)","v":60},{"$f":"Temperaturen!$B$2+Temperaturen!$B$6+(S156/2)","v":60},{"$f":"Temperaturen!$B$2+Temperaturen!$B$6+(T156/2)","v":60},{"$f":"Temperaturen!$B$2+Temperaturen!$B$6+(U156/2)","v":60},{"$f":"Temperaturen!$B$2+Temperaturen!$B$6+(V156/2)","v":60},{"$f":"Temperaturen!$B$2+Temperaturen!$B$6+(W156/2)","v":60}]
[null,null,"Solar RL Temperatur (°C) > ",{"$f":"$B$2+$B$6-(D156/2)","v":59.694859438216213},59.816717593795538,59.747833523307278,59.835684276394623,59.219680748918918,59.454233927003749,null,{"$f":"Temperaturen!$B$2+Temperaturen!$B$6-(K156/2)","v":59.916053400325943},{"$f":"Temperaturen!$B$2+Temperaturen!$B$6-(L156/2)","v":60},{"$f":"Temperaturen!$B$2+Temperaturen!$B$6-(M156/2)","v":59.956590282703459},{"$f":"Temperaturen!$B$2+Temperaturen!$B$6-(N156/2)","v":60},{"$f":"Temperaturen!$B$2+Temperaturen!$B$6-(O156/2)","v":59.440606889513511},{"$f":"Temperaturen!$B$2+Temperaturen!$B$6-(P156/2)","v":59.667559361608483},null,{"$f":"Temperaturen!$B$2+Temperaturen!$B$6-(R156/2)","v":60},{"$f":"Temperaturen!$B$2+Temperaturen!$B$6-(S156/2)","v":60},{"$f":"Temperaturen!$B$2+Temperaturen!$B$6-(T156/2)","v":60},{"$f":"Temperaturen!$B$2+Temperaturen!$B$6-(U156/2)","v":60},{"$f":"Temperaturen!$B$2+Temperaturen!$B$6-(V156/2)","v":60},{"$f":"Temperaturen!$B$2+Temperaturen!$B$6-(W156/2)","v":60}]
["stark wolkig Azimut > ",-40,"Diff. Solarkreis (K) > ",{"$f":"Sommer!D118/(3.7*($B$9/3600))","v":0.79555729427027},{"$f":"Sommer!E118/(3.7*($B$9/3600))","v":0.54298742524089294},{"$f":"Sommer!F118/(3.7*($B$9/3600))","v":0.69301202223373148},{"$f":"Sommer!G118/(3.7*($B$9/3600))","v":0.49959667261350021},{"$f":"Sommer!H118/(3.7*($B$9/3600))","v":1.7591124500717044},{"$f":"Sommer!I118/(3.7*($B$9/3600))","v":1.1781009672313461},null,{"$f":"Herbstfrühjahr!D118/(3.7*(Temperaturen!$B$9/3600))","v":0.44399916848432436},{"$f":"Herbstfrühjahr!E118/(3.7*(Temperaturen!$B$9/3600))","v":0.22308572743595773},{"$f":"Herbstfrühjahr!F118/(3.7*(Temperaturen!$B$9/3600))","v":0.36258572683981527},{"$f":"Herbstfrühjahr!G118/(3.7*(Temperaturen!$B$9/3600))","v":0.17275605538969496},{"$f":"Herbstfrühjahr!H118/(3.7*(Temperaturen!$B$9/3600))","v":1.3776395882713734},{"$f":"Herbstfrühjahr!I118/(3.7*(Temperaturen!$B$9/3600))","v":0.84865818209957333},null,{"$f":"Winter!D118/(3.7*(Temperaturen!$B$9/3600))","v":0},{"$f":"Winter!E118/(3.7*(Temperaturen!$B$9/3600))","v":0},{"$f":"Winter!F118/(3.7*(Temperaturen!$B$9/3600))","v":0},{"$f":"Winter!G118/(3.7*(Temperaturen!$B$9/3600))","v":0},{"$f":"Winter!H118/(3.7*(Temperaturen!$B$9/3600))","v":0.21006430754991737},{"$f":"Winter!I118/(3.7*(Temperaturen!$B$9/3600))","v":0}]
[null,null,"Solar VL Temperatur (°C) > ",{"$f":"$B$2+$B$6+(D159/2)","v":60.397778647135134},60.271493712620448,60.346506011116865,60.249798336306753,60.879556225035856,60.589050483615672,null,{"$f":"Temperaturen!$B$2+Temperaturen!$B$6+(K159/2)","v":60.221999584242162},{"$f":"Temperaturen!$B$2+Temperaturen!$B$6+(L159/2)","v":60.111542863717979},{"$f":"Temperaturen!$B$2+Temperaturen!$B$6+(M159/2)","v":60.181292863419905},{"$f":"Temperaturen!$B$2+Temperaturen!$B$6+(N159/2)","v":60.086378027694849},{"$f":"Temperaturen!$B$2+Temperaturen!$B$6+(O159/2)","v":60.688819794135689},{"$f":"Temperaturen!$B$2+Temperaturen!$B$6+(P159/2)","v":60.424329091049785},null,{"$f":"Temperaturen!$B$2+Temperaturen!$B$6+(R159/2)","v":60},{"$f":"Temperaturen!$B$2+Temperaturen!$B$6+(S159/2)","v":60},{"$f":"Temperaturen!$B$2+Temperaturen!$B$6+(T159/2)","v":60},{"$f":"Temperaturen!$B$2+Temperaturen!$B$6+(U159/2)","v":60},{"$f":"Temperaturen!$B$2+Temperaturen!$B$6+(V159/2)","v":60.105032153774957},{"$f":"Temperaturen!$B$2+Temperaturen!$B$6+(W159/2)","v":60}]
[null,null,"Solar RL Temperatur (°C) > ",{"$f":"$B$2+$B$6-(D159/2)","v":59.602221352864866},59.728506287379552,59.653493988883135,59.750201663693247,59.120443774964144,59.410949516384328,null,{"$f":"Temperaturen!$B$2+Temperaturen!$B$6-(K159/2)","v":59.778000415757838},{"$f":"Temperaturen!$B$2+Temperaturen!$B$6-(L159/2)","v":59.888457136282021},{"$f":"Temperaturen!$B$2+Temperaturen!$B$6-(M159/2)","v":59.818707136580095},{"$f":"Temperaturen!$B$2+Temperaturen!$B$6-(N159/2)","v":59.913621972305151},{"$f":"Temperaturen!$B$2+Temperaturen!$B$6-(O159/2)","v":59.311180205864311},{"$f":"Temperaturen!$B$2+Temperaturen!$B$6-(P159/2)","v":59.575670908950215},null,{"$f":"Temperaturen!$B$2+Temperaturen!$B$6-(R159/2)","v":60},{"$f":"Temperaturen!$B$2+Temperaturen!$B$6-(S159/2)","v":60},{"$f":"Temperaturen!$B$2+Temperaturen!$B$6-(T159/2)","v":60},{"$f":"Temperaturen!$B$2+Temperaturen!$B$6-(U159/2)","v":60},{"$f":"Temperaturen!$B$2+Temperaturen!$B$6-(V159/2)","v":59.894967846225043},{"$f":"Temperaturen!$B$2+Temperaturen!$B$6-(W159/2)","v":60}]
["stark wolkig Azimut > ",-30,"Diff. Solarkreis (K) > ",{"$f":"Sommer!D119/(3.7*($B$9/3600))","v":0.93348473424324385},{"$f":"Sommer!E119/(3.7*($B$9/3600))","v":0.65449009109283218},{"$f":"Sommer!F119/(3.7*($B$9/3600))","v":0.81111445985497688},{"$f":"Sommer!G119/(3.7*($B$9/3600))","v":0.61021670829450181},{"$f":"Sommer!H119/(3.7*($B$9/3600))","v":1.8448779882956432},{"$f":"Sommer!I119/(3.7*($B$9/3600))","v":1.1180077396999877},null,{"$f":"Herbstfrühjahr!D119/(3.7*(Temperaturen!$B$9/3600))","v":0.74861599128324352},{"$f":"Herbstfrühjahr!E119/(3.7*(Temperaturen!$B$9/3600))","v":0.49771235632432431},{"$f":"Herbstfrühjahr!F119/(3.7*(Temperaturen!$B$9/3600))","v":0.6516442537534608},{"$f":"Herbstfrühjahr!G119/(3.7*(Temperaturen!$B$9/3600))","v":0.44574447156011221},{"$f":"Herbstfrühjahr!H119/(3.7*(Temperaturen!$B$9/3600))","v":1.5981795437043578},{"$f":"Herbstfrühjahr!I119/(3.7*(Temperaturen!$B$9/3600))","v":0.94575708276839521},null,{"$f":"Winter!D119/(3.7*(Temperaturen!$B$9/3600))","v":0},{"$f":"Winter!E119/(3.7*(Temperaturen!$B$9/3600))","v":0},{"$f":"Winter!F119/(3.7*(Temperaturen!$B$9/3600))","v":0},{"$f":"Winter!G119/(3.7*(Temperaturen!$B$9/3600))","v":0},{"$f":"Winter!H119/(3.7*(Temperaturen!$B$9/3600))","v":0.60348308360286829},{"$f":"Winter!I119/(3.7*(Temperaturen!$B$9/3600))","v":0.12680771601849225}]
[null,null,"Solar VL Temperatur (°C) > ",{"$f":"$B$2+$B$6+(D162/2)","v":60.466742367121618},60.32724504554642,60.405557229927489,60.305108354147251,60.922438994147825,60.559003869849995,null,{"$f":"Temperaturen!$B$2+Temperaturen!$B$6+(K162/2)","v":60.374307995641622},{"$f":"Temperaturen!$B$2+Temperaturen!$B$6+(L162/2)","v":60.248856178162164},{"$f":"Temperaturen!$B$2+Temperaturen!$B$6+(M162/2)","v":60.32582212687673},{"$f":"Temperaturen!$B$2+Temperaturen!$B$6+(N162/2)","v":60.222872235780059},{"$f":"Temperaturen!$B$2+Temperaturen!$B$6+(O162/2)","v":60.799089771852181},{"$f":"Temperaturen!$B$2+Temperaturen!$B$6+(P162/2)","v":60.472878541384198},null,{"$f":"Temperaturen!$B$2+Temperaturen!$B$6+(R162/2)","v":60},{"$f":"Temperaturen!$B$2+Temperaturen!$B$6+(S162/2)","v":60},{"$f":"Temperaturen!$B$2+Temperaturen!$B$6+(T162/2)","v":60},{"$f":"Temperaturen!$B$2+Temperaturen!$B$6+(U162/2)","v":60},{"$f":"Temperaturen!$B$2+Temperaturen!$B$6+(V162/2)","v":60.301741541801434},{"$f":"Temperaturen!$B$2+Temperaturen!$B$6+(W162/2)","v":60.063403858009245}]
[null,null,"Solar RL Temperatur (°C) > ",{"$f":"$B$2+$B$6-(D162/2)","v":59.533257632878382},59.67275495445358,59.594442770072511,59.694891645852749,59.077561005852175,59.440996130150005,null,{"$f":"Temperaturen!$B$2+Temperaturen!$B$6-(K162/2)","v":59.625692004358378},{"$f":"Temperaturen!$B$2+Temperaturen!$B$6-(L162/2)","v":59.751143821837836},{"$f":"Temperaturen!$B$2+Temperaturen!$B$6-(M162/2)","v":59.67417787312327},{"$f":"Temperaturen!$B$2+Temperaturen!$B$6-(N162/2)","v":59.777127764219941},{"$f":"Temperaturen!$B$2+Temperaturen!$B$6-(O162/2)","v":59.200910228147819},{"$f":"Temperaturen!$B$2+Temperaturen!$B$6-(P162/2)","v":59.527121458615802},null,{"$f":"Temperaturen!$B$2+Temperaturen!$B$6-(R162/2)","v":60},{"$f":"Temperaturen!$B$2+Temperaturen!$B$6-(S162/2)","v":60},{"$f":"Temperaturen!$B$2+Temperaturen!$B$6-(T162/2)","v":60},{"$f":"Temperaturen!$B$2+Temperaturen!$B$6-(U162/2)","v":60},{"$f":"Temperaturen!$B$2+Temperaturen!$B$6-(V162/2)","v":59.698258458198566},{"$f":"Temperaturen!$B$2+Temperaturen!$B$6-(W162/2)","v":59.936596141990755}]
["stark wolkig Azimut > ",-20,"Diff. Solarkreis (K) > ",{"$f":"Sommer!D120/(3.7*($B$9/3600))","v":1.0147019837837841},{"$f":"Sommer!E120/(3.7*($B$9/3600))","v":0.72841660202115155},{"$f":"Sommer!F120/(3.7*($B$9/3600))","v":0.88984784025614416},{"$f":"Sommer!G120/(3.7*($B$9/3600))","v":0.68341503906270817},{"$f":"Sommer!H120/(3.7*($B$9/3600))","v":1.8801721889520138},{"$f":"Sommer!I120/(3.7*($B$9/3600))","v":1.0541797573329885},null,{"$f":"Herbstfrühjahr!D120/(3.7*(Temperaturen!$B$9/3600))","v":0.96175281356756848},{"$f":"Herbstfrühjahr!E120/(3.7*(Temperaturen!$B$9/3600))","v":0.69536498831492455},{"$f":"Herbstfrühjahr!F120/(3.7*(Temperaturen!$B$9/3600))","v":0.86005605950880526},{"$f":"Herbstfrühjahr!G120/(3.7*(Temperaturen!$B$9/3600))","v":0.64207527857063051},{"$f":"Herbstfrühjahr!H120/(3.7*(Temperaturen!$B$9/3600))","v":1.7353755761103149},{"$f":"Herbstfrühjahr!I120/(3.7*(Temperaturen!$B$9/3600))","v":0.97875013309773751},null,{"$f":"Winter!D120/(3.7*(Temperaturen!$B$9/3600))","v":0},{"$f":"Winter!E120/(3.7*(Temperaturen!$B$9/3600))","v":0},{"$f":"Winter!F120/(3.7*(Temperaturen!$B$9/3600))","v":0},{"$f":"Winter!G120/(3.7*(Temperaturen!$B$9/3600))","v":0},{"$f":"Winter!H120/(3.7*(Temperaturen!$B$9/3600))","v":0.84882237264092686},{"$f":"Winter!I120/(3.7*(Temperaturen!$B$9/3600))","v":0.31759810242441494}]
[null,null,"Solar VL Temperatur (°C) > ",{"$f":"$B$2+$B$6+(D165/2)","v":60.50735099189189},60.364208301010578,60.444923920128069,60.341707519531354,60.940086094476008,60.527089878666494,null,{"$f":"Temperaturen!$B$2+Temperaturen!$B$6+(K165/2)","v":60.480876406783786},{"$f":"Temperaturen!$B$2+Temperaturen!$B$6+(L165/2)","v":60.347682494157461},{"$f":"Temperaturen!$B$2+Temperaturen!$B$6+(M165/2)","v":60.430028029754403},{"$f":"Temperaturen!$B$2+Temperaturen!$B$6+(N165/2)","v":60.321037639285315},{"$f":"Temperaturen!$B$2+Temperaturen!$B$6+(O165/2)","v":60.867687788055157},{"$f":"Temperaturen!$B$2+Temperaturen!$B$6+(P165/2)","v":60.489375066548867},null,{"$f":"Temperaturen!$B$2+Temperaturen!$B$6+(R165/2)","v":60},{"$f":"Temperaturen!$B$2+Temperaturen!$B$6+(S165/2)","v":60},{"$f":"Temperaturen!$B$2+Temperaturen!$B$6+(T165/2)","v":60},{"$f":"Temperaturen!$B$2+Temperaturen!$B$6+(U165/2)","v":60},{"$f":"Temperaturen!$B$2+Temperaturen!$B$6+(V165/2)","v":60.424411186320462},{"$f":"Temperaturen!$B$2+Temperaturen!$B$6+(W165/2)","v":60.158799051212206}]
[null,null,"Solar RL Temperatur (°C) > ",{"$f":"$B$2+$B$6-(D165/2)","v":59.49264900810811},59.635791698989422,59.555076079871931,59.658292480468646,59.059913905523992,59.472910121333506,null,{"$f":"Temperaturen!$B$2+Temperaturen!$B$6-(K165/2)","v":59.519123593216214},{"$f":"Temperaturen!$B$2+Temperaturen!$B$6-(L165/2)","v":59.652317505842539},{"$f":"Temperaturen!$B$2+Temperaturen!$B$6-(M165/2)","v":59.569971970245597},{"$f":"Temperaturen!$B$2+Temperaturen!$B$6-(N165/2)","v":59.678962360714685},{"$f":"Temperaturen!$B$2+Temperaturen!$B$6-(O165/2)","v":59.132312211944843},{"$f":"Temperaturen!$B$2+Temperaturen!$B$6-(P165/2)","v":59.510624933451133},null,{"$f":"Temperaturen!$B$2+Temperaturen!$B$6-(R165/2)","v":60},{"$f":"Temperaturen!$B$2+Temperaturen!$B$6-(S165/2)","v":60},{"$f":"Temperaturen!$B$2+Temperaturen!$B$6-(T165/2)","v":60},{"$f":"Temperaturen!$B$2+Temperaturen!$B$6-(U165/2)","v":60},{"$f":"Temperaturen!$B$2+Temperaturen!$B$6-(V165/2)","v":59.575588813679538},{"$f":"Temperaturen!$B$2+Temperaturen!$B$6-(W165/2)","v":59.841200948787794}]
["stark wolkig Azimut > ",-10,"Diff. Solarkreis (K) > ",{"$f":"Sommer!D121/(3.7*($B$9/3600))","v":1.0571222310810815},{"$f":"Sommer!E121/(3.7*($B$9/3600))","v":0.77591321269095181},{"$f":"Sommer!F121/(3.7*($B$9/3600))","v":0.94089024861098025},{"$f":"Sommer!G121/(3.7*($B$9/3600))","v":0.73029210491279473},{"$f":"Sommer!H121/(3.7*($B$9/3600))","v":1.9117156488086056},{"$f":"Sommer!I121/(3.7*($B$9/3600))","v":1.0381297731798784},null,{"$f":"Herbstfrühjahr!D121/(3.7*(Temperaturen!$B$9/3600))","v":1.0726980757297302},{"$f":"Herbstfrühjahr!E121/(3.7*(Temperaturen!$B$9/3600))","v":0.80736745287896605},{"$f":"Herbstfrühjahr!F121/(3.7*(Temperaturen!$B$9/3600))","v":0.97873100024484416},{"$f":"Herbstfrühjahr!G121/(3.7*(Temperaturen!$B$9/3600))","v":0.75310796772733357},{"$f":"Herbstfrühjahr!H121/(3.7*(Temperaturen!$B$9/3600))","v":1.8178738557352458},{"$f":"Herbstfrühjahr!I121/(3.7*(Temperaturen!$B$9/3600))","v":1.0051707663157896},null,{"$f":"Winter!D121/(3.7*(Temperaturen!$B$9/3600))","v":0.21542234302702748},{"$f":"Winter!E121/(3.7*(Temperaturen!$B$9/3600))","v":1.9217883901292917E-2},{"$f":"Winter!F121/(3.7*(Temperaturen!$B$9/3600))","v":0.15486619538562971},{"$f":"Winter!G121/(3.7*(Temperaturen!$B$9/3600))","v":0},{"$f":"Winter!H121/(3.7*(Temperaturen!$B$9/3600))","v":1.0424506877606179},{"$f":"Winter!I121/(3.7*(Temperaturen!$B$9/3600))","v":0.45574680710720306}]
[null,null,"Solar VL Temperatur (°C) > ",{"$f":"$B$2+$B$6+(D168/2)","v":60.528561115540541},60.387956606345476,60.470445124305492,60.365146052456396,60.955857824404305,60.519064886589938,null,{"$f":"Temperaturen!$B$2+Temperaturen!$B$6+(K168/2)","v":60.536349037864866},{"$f":"Temperaturen!$B$2+Temperaturen!$B$6+(L168/2)","v":60.403683726439482},{"$f":"Temperaturen!$B$2+Temperaturen!$B$6+(M168/2)","v":60.489365500122425},{"$f":"Temperaturen!$B$2+Temperaturen!$B$6+(N168/2)","v":60.376553983863666},{"$f":"Temperaturen!$B$2+Temperaturen!$B$6+(O168/2)","v":60.908936927867622},{"$f":"Temperaturen!$B$2+Temperaturen!$B$6+(P168/2)","v":60.502585383157893},null,{"$f":"Temperaturen!$B$2+Temperaturen!$B$6+(R168/2)","v":60.107711171513515},{"$f":"Temperaturen!$B$2+Temperaturen!$B$6+(S168/2)","v":60.009608941950646},{"$f":"Temperaturen!$B$2+Temperaturen!$B$6+(T168/2)","v":60.077433097692818},{"$f":"Temperaturen!$B$2+Temperaturen!$B$6+(U168/2)","v":60},{"$f":"Temperaturen!$B$2+Temperaturen!$B$6+(V168/2)","v":60.52122534388031},{"$f":"Temperaturen!$B$2+Temperaturen!$B$6+(W168/2)","v":60.227873403553602}]
[null,null,"Solar RL Temperatur (°C) > ",{"$f":"$B$2+$B$6-(D168/2)","v":59.471438884459459},59.612043393654524,59.529554875694508,59.634853947543604,59.044142175595695,59.480935113410062,null,{"$f":"Temperaturen!$B$2+Temperaturen!$B$6-(K168/2)","v":59.463650962135134},{"$f":"Temperaturen!$B$2+Temperaturen!$B$6-(L168/2)","v":59.596316273560518},{"$f":"Temperaturen!$B$2+Temperaturen!$B$6-(M168/2)","v":59.510634499877575},{"$f":"Temperaturen!$B$2+Temperaturen!$B$6-(N168/2)","v":59.623446016136334},{"$f":"Temperaturen!$B$2+Temperaturen!$B$6-(O168/2)","v":59.091063072132378},{"$f":"Temperaturen!$B$2+Temperaturen!$B$6-(P168/2)","v":59.497414616842107},null,{"$f":"Temperaturen!$B$2+Temperaturen!$B$6-(R168/2)","v":59.892288828486485},{"$f":"Temperaturen!$B$2+Temperaturen!$B$6-(S168/2)","v":59.990391058049354},{"$f":"Temperaturen!$B$2+Temperaturen!$B$6-(T168/2)","v":59.922566902307182},{"$f":"Temperaturen!$B$2+Temperaturen!$B$6-(U168/2)","v":60},{"$f":"Temperaturen!$B$2+Temperaturen!$B$6-(V168/2)","v":59.47877465611969},{"$f":"Temperaturen!$B$2+Temperaturen!$B$6-(W168/2)","v":59.772126596446398}]
["stark wolkig Azimut > ",0,"Diff. Solarkreis (K) > ",{"$f":"Sommer!D122/(3.7*($B$9/3600))","v":1.0669115189189189},{"$f":"Sommer!E122/(3.7*($B$9/3600))","v":0.78517602820211518},{"$f":"Sommer!F122/(3.7*($B$9/3600))","v":0.95059502853375999},{"$f":"Sommer!G122/(3.7*($B$9/3600))","v":0.73951684729064049},{"$f":"Sommer!H122/(3.7*($B$9/3600))","v":1.8999949591836738},{"$f":"Sommer!I122/(3.7*($B$9/3600))","v":1.0437825557480926},null,{"$f":"Herbstfrühjahr!D122/(3.7*(Temperaturen!$B$9/3600))","v":1.1085921311351354},{"$f":"Herbstfrühjahr!E122/(3.7*(Temperaturen!$B$9/3600))","v":0.84133110975323178},{"$f":"Herbstfrühjahr!F122/(3.7*(Temperaturen!$B$9/3600))","v":1.0143151932950367},{"$f":"Herbstfrühjahr!G122/(3.7*(Temperaturen!$B$9/3600))","v":0.78693202311276811},{"$f":"Herbstfrühjahr!H122/(3.7*(Temperaturen!$B$9/3600))","v":1.8263014610038613},{"$f":"Herbstfrühjahr!I122/(3.7*(Temperaturen!$B$9/3600))","v":1.0258976357325744},null,{"$f":"Winter!D122/(3.7*(Temperaturen!$B$9/3600))","v":0.26502140140540559},{"$f":"Winter!E122/(3.7*(Temperaturen!$B$9/3600))","v":6.6149482491186851E-2},{"$f":"Winter!F122/(3.7*(Temperaturen!$B$9/3600))","v":0.20403708032771417},{"$f":"Winter!G122/(3.7*(Temperaturen!$B$9/3600))","v":7.1338007722006351E-3},{"$f":"Winter!H122/(3.7*(Temperaturen!$B$9/3600))","v":1.0686458134583567},{"$f":"Winter!I122/(3.7*(Temperaturen!$B$9/3600))","v":0.48438757211948791}]
[null,null,"Solar VL Temperatur (°C) > ",{"$f":"$B$2+$B$6+(D171/2)","v":60.533455759459457},60.392588014101058,60.475297514266877,60.369758423645322,60.949997479591836,60.521891277874047,null,{"$f":"Temperaturen!$B$2+Temperaturen!$B$6+(K171/2)","v":60.55429606556757},{"$f":"Temperaturen!$B$2+Temperaturen!$B$6+(L171/2)","v":60.420665554876614},{"$f":"Temperaturen!$B$2+Temperaturen!$B$6+(M171/2)","v":60.507157596647517},{"$f":"Temperaturen!$B$2+Temperaturen!$B$6+(N171/2)","v":60.393466011556384},{"$f":"Temperaturen!$B$2+Temperaturen!$B$6+(O171/2)","v":60.913150730501933},{"$f":"Temperaturen!$B$2+Temperaturen!$B$6+(P171/2)","v":60.512948817866288},null,{"$f":"Temperaturen!$B$2+Temperaturen!$B$6+(R171/2)","v":60.132510700702703},{"$f":"Temperaturen!$B$2+Temperaturen!$B$6+(S171/2)","v":60.033074741245592},{"$f":"Temperaturen!$B$2+Temperaturen!$B$6+(T171/2)","v":60.102018540163854},{"$f":"Temperaturen!$B$2+Temperaturen!$B$6+(U171/2)","v":60.003566900386097},{"$f":"Temperaturen!$B$2+Temperaturen!$B$6+(V171/2)","v":60.53432290672918},{"$f":"Temperaturen!$B$2+Temperaturen!$B$6+(W171/2)","v":60.242193786059744}]
[null,null,"Solar RL Temperatur (°C) > ",{"$f":"$B$2+$B$6-(D171/2)","v":59.466544240540543},59.607411985898942,59.524702485733123,59.630241576354678,59.050002520408164,59.478108722125953,null,{"$f":"Temperaturen!$B$2+Temperaturen!$B$6-(K171/2)","v":59.44570393443243},{"$f":"Temperaturen!$B$2+Temperaturen!$B$6-(L171/2)","v":59.579334445123386},{"$f":"Temperaturen!$B$2+Temperaturen!$B$6-(M171/2)","v":59.492842403352483},{"$f":"Temperaturen!$B$2+Temperaturen!$B$6-(N171/2)","v":59.606533988443616},{"$f":"Temperaturen!$B$2+Temperaturen!$B$6-(O171/2)","v":59.086849269498067},{"$f":"Temperaturen!$B$2+Temperaturen!$B$6-(P171/2)","v":59.487051182133712},null,{"$f":"Temperaturen!$B$2+Temperaturen!$B$6-(R171/2)","v":59.867489299297297},{"$f":"Temperaturen!$B$2+Temperaturen!$B$6-(S171/2)","v":59.966925258754408},{"$f":"Temperaturen!$B$2+Temperaturen!$B$6-(T171/2)","v":59.897981459836146},{"$f":"Temperaturen!$B$2+Temperaturen!$B$6-(U171/2)","v":59.996433099613903},{"$f":"Temperaturen!$B$2+Temperaturen!$B$6-(V171/2)","v":59.46567709327082},{"$f":"Temperaturen!$B$2+Temperaturen!$B$6-(W171/2)","v":59.757806213940256}]
["stark wolkig Azimut > ",10,"Diff. Solarkreis (K) > ",{"$f":"Sommer!D123/(3.7*($B$9/3600))","v":1.0571222310810815},{"$f":"Sommer!E123/(3.7*($B$9/3600))","v":0.77591321269095181},{"$f":"Sommer!F123/(3.7*($B$9/3600))","v":0.94089024861098025},{"$f":"Sommer!G123/(3.7*($B$9/3600))","v":0.73029210491279473},{"$f":"Sommer!H123/(3.7*($B$9/3600))","v":1.9117156488086056},{"$f":"Sommer!I123/(3.7*($B$9/3600))","v":1.0381297731798784},null,{"$f":"Herbstfrühjahr!D123/(3.7*(Temperaturen!$B$9/3600))","v":1.0726980757297302},{"$f":"Herbstfrühjahr!E123/(3.7*(Temperaturen!$B$9/3600))","v":0.80736745287896605},{"$f":"Herbstfrühjahr!F123/(3.7*(Temperaturen!$B$9/3600))","v":0.97873100024484416},{"$f":"Herbstfrühjahr!G123/(3.7*(Temperaturen!$B$9/3600))","v":0.75310796772733357},{"$f":"Herbstfrühjahr!H123/(3.7*(Temperaturen!$B$9/3600))","v":1.8178738557352458},{"$f":"Herbstfrühjahr!I123/(3.7*(Temperaturen!$B$9/3600))","v":1.0051707663157896},null,{"$f":"Winter!D123/(3.7*(Temperaturen!$B$9/3600))","v":0.21542234302702748},{"$f":"Winter!E123/(3.7*(Temperaturen!$B$9/3600))","v":1.9217883901292917E-2},{"$f":"Winter!F123/(3.7*(Temperaturen!$B$9/3600))","v":0.15486619538562971},{"$f":"Winter!G123/(3.7*(Temperaturen!$B$9/3600))","v":0},{"$f":"Winter!H123/(3.7*(Temperaturen!$B$9/3600))","v":1.0424506877606179},{"$f":"Winter!I123/(3.7*(Temperaturen!$B$9/3600))","v":0.45574680710720306}]
[null,null,"Solar VL Temperatur (°C) > ",{"$f":"$B$2+$B$6+(D174/2)","v":60.528561115540541},60.387956606345476,60.470445124305492,60.365146052456396,60.955857824404305,60.519064886589938,null,{"$f":"Temperaturen!$B$2+Temperaturen!$B$6+(K174/2)","v":60.536349037864866},{"$f":"Temperaturen!$B$2+Temperaturen!$B$6+(L174/2)","v":60.403683726439482},{"$f":"Temperaturen!$B$2+Temperaturen!$B$6+(M174/2)","v":60.489365500122425},{"$f":"Temperaturen!$B$2+Temperaturen!$B$6+(N174/2)","v":60.376553983863666},{"$f":"Temperaturen!$B$2+Temperaturen!$B$6+(O174/2)","v":60.908936927867622},{"$f":"Temperaturen!$B$2+Temperaturen!$B$6+(P174/2)","v":60.502585383157893},null,{"$f":"Temperaturen!$B$2+Temperaturen!$B$6+(R174/2)","v":60.107711171513515},{"$f":"Temperaturen!$B$2+Temperaturen!$B$6+(S174/2)","v":60.009608941950646},{"$f":"Temperaturen!$B$2+Temperaturen!$B$6+(T174/2)","v":60.077433097692818},{"$f":"Temperaturen!$B$2+Temperaturen!$B$6+(U174/2)","v":60},{"$f":"Temperaturen!$B$2+Temperaturen!$B$6+(V174/2)","v":60.52122534388031},{"$f":"Temperaturen!$B$2+Temperaturen!$B$6+(W174/2)","v":60.227873403553602}]
[null,null,"Solar RL Temperatur (°C) > ",{"$f":"$B$2+$B$6-(D174/2)","v":59.471438884459459},59.612043393654524,59.529554875694508,59.634853947543604,59.044142175595695,59.480935113410062,null,{"$f":"Temperaturen!$B$2+Temperaturen!$B$6-(K174/2)","v":59.463650962135134},{"$f":"Temperaturen!$B$2+Temperaturen!$B$6-(L174/2)","v":59.596316273560518},{"$f":"Temperaturen!$B$2+Temperaturen!$B$6-(M174/2)","v":59.510634499877575},{"$f":"Temperaturen!$B$2+Temperaturen!$B$6-(N174/2)","v":59.623446016136334},{"$f":"Temperaturen!$B$2+Temperaturen!$B$6-(O174/2)","v":59.091063072132378},{"$f":"Temperaturen!$B$2+Temperaturen!$B$6-(P174/2)","v":59.497414616842107},null,{"$f":"Temperaturen!$B$2+Temperaturen!$B$6-(R174/2)","v":59.892288828486485},{"$f":"Temperaturen!$B$2+Temperaturen!$B$6-(S174/2)","v":59.990391058049354},{"$f":"Temperaturen!$B$2+Temperaturen!$B$6-(T174/2)","v":59.922566902307182},{"$f":"Temperaturen!$B$2+Temperaturen!$B$6-(U174/2)","v":60},{"$f":"Temperaturen!$B$2+Temperaturen!$B$6-(V174/2)","v":59.47877465611969},{"$f":"Temperaturen!$B$2+Temperaturen!$B$6-(W174/2)","v":59.772126596446398}]
["stark wolkig Azimut > ",20,"Diff. Solarkreis (K) > ",{"$f":"Sommer!D124/(3.7*($B$9/3600))","v":1.0147019837837841},{"$f":"Sommer!E124/(3.7*($B$9/3600))","v":0.72841660202115155},{"$f":"Sommer!F124/(3.7*($B$9/3600))","v":0.88984784025614416},{"$f":"Sommer!G124/(3.7*($B$9/3600))","v":0.68341503906270817},{"$f":"Sommer!H124/(3.7*($B$9/3600))","v":1.8801721889520138},{"$f":"Sommer!I124/(3.7*($B$9/3600))","v":1.0541797573329885},null,{"$f":"Herbstfrühjahr!D124/(3.7*(Temperaturen!$B$9/3600))","v":0.96175281356756848},{"$f":"Herbstfrühjahr!E124/(3.7*(Temperaturen!$B$9/3600))","v":0.69536498831492455},{"$f":"Herbstfrühjahr!F124/(3.7*(Temperaturen!$B$9/3600))","v":0.86005605950880526},{"$f":"Herbstfrühjahr!G124/(3.7*(Temperaturen!$B$9/3600))","v":0.64207527857063051},{"$f":"Herbstfrühjahr!H124/(3.7*(Temperaturen!$B$9/3600))","v":1.7353755761103149},{"$f":"Herbstfrühjahr!I124/(3.7*(Temperaturen!$B$9/3600))","v":0.97875013309773751},null,{"$f":"Winter!D124/(3.7*(Temperaturen!$B$9/3600))","v":0},{"$f":"Winter!E124/(3.7*(Temperaturen!$B$9/3600))","v":0},{"$f":"Winter!F124/(3.7*(Temperaturen!$B$9/3600))","v":0},{"$f":"Winter!G124/(3.7*(Temperaturen!$B$9/3600))","v":0},{"$f":"Winter!H124/(3.7*(Temperaturen!$B$9/3600))","v":0.84882237264092686},{"$f":"Winter!I124/(3.7*(Temperaturen!$B$9/3600))","v":0.31759810242441494}]
[null,null,"Solar VL Temperatur (°C) > ",{"$f":"$B$2+$B$6+(D177/2)","v":60.50735099189189},60.364208301010578,60.444923920128069,60.341707519531354,60.940086094476008,60.527089878666494,null,{"$f":"Temperaturen!$B$2+Temperaturen!$B$6+(K177/2)","v":60.480876406783786},{"$f":"Temperaturen!$B$2+Temperaturen!$B$6+(L177/2)","v":60.347682494157461},{"$f":"Temperaturen!$B$2+Temperaturen!$B$6+(M177/2)","v":60.430028029754403},{"$f":"Temperaturen!$B$2+Temperaturen!$B$6+(N177/2)","v":60.321037639285315},{"$f":"Temperaturen!$B$2+Temperaturen!$B$6+(O177/2)","v":60.867687788055157},{"$f":"Temperaturen!$B$2+Temperaturen!$B$6+(P177/2)","v":60.489375066548867},null,{"$f":"Temperaturen!$B$2+Temperaturen!$B$6+(R177/2)","v":60},{"$f":"Temperaturen!$B$2+Temperaturen!$B$6+(S177/2)","v":60},{"$f":"Temperaturen!$B$2+Temperaturen!$B$6+(T177/2)","v":60},{"$f":"Temperaturen!$B$2+Temperaturen!$B$6+(U177/2)","v":60},{"$f":"Temperaturen!$B$2+Temperaturen!$B$6+(V177/2)","v":60.424411186320462},{"$f":"Temperaturen!$B$2+Temperaturen!$B$6+(W177/2)","v":60.158799051212206}]
[null,null,"Solar RL Temperatur (°C) > ",{"$f":"$B$2+$B$6-(D177/2)","v":59.49264900810811},59.635791698989422,59.555076079871931,59.658292480468646,59.059913905523992,59.472910121333506,null,{"$f":"Temperaturen!$B$2+Temperaturen!$B$6-(K177/2)","v":59.519123593216214},{"$f":"Temperaturen!$B$2+Temperaturen!$B$6-(L177/2)","v":59.652317505842539},{"$f":"Temperaturen!$B$2+Temperaturen!$B$6-(M177/2)","v":59.569971970245597},{"$f":"Temperaturen!$B$2+Temperaturen!$B$6-(N177/2)","v":59.678962360714685},{"$f":"Temperaturen!$B$2+Temperaturen!$B$6-(O177/2)","v":59.132312211944843},{"$f":"Temperaturen!$B$2+Temperaturen!$B$6-(P177/2)","v":59.510624933451133},null,{"$f":"Temperaturen!$B$2+Temperaturen!$B$6-(R177/2)","v":60},{"$f":"Temperaturen!$B$2+Temperaturen!$B$6-(S177/2)","v":60},{"$f":"Temperaturen!$B$2+Temperaturen!$B$6-(T177/2)","v":60},{"$f":"Temperaturen!$B$2+Temperaturen!$B$6-(U177/2)","v":60},{"$f":"Temperaturen!$B$2+Temperaturen!$B$6-(V177/2)","v":59.575588813679538},{"$f":"Temperaturen!$B$2+Temperaturen!$B$6-(W177/2)","v":59.841200948787794}]
["stark wolkig Azimut > ",30,"Diff. Solarkreis (K) > ",{"$f":"Sommer!D125/(3.7*($B$9/3600))","v":0.93348473424324385},{"$f":"Sommer!E125/(3.7*($B$9/3600))","v":0.65449009109283218},{"$f":"Sommer!F125/(3.7*($B$9/3600))","v":0.81111445985497688},{"$f":"Sommer!G125/(3.7*($B$9/3600))","v":0.61021670829450181},{"$f":"Sommer!H125/(3.7*($B$9/3600))","v":1.8448779882956432},{"$f":"Sommer!I125/(3.7*($B$9/3600))","v":1.1180077396999877},null,{"$f":"Herbstfrühjahr!D127/(3.7*(Temperaturen!$B$9/3600))","v":0.16789319934810829},{"$f":"Herbstfrühjahr!E127/(3.7*(Temperaturen!$B$9/3600))","v":0},{"$f":"Herbstfrühjahr!F127/(3.7*(Temperaturen!$B$9/3600))","v":8.6819434593087816E-2},{"$f":"Herbstfrühjahr!G127/(3.7*(Temperaturen!$B$9/3600))","v":0},{"$f":"Herbstfrühjahr!H127/(3.7*(Temperaturen!$B$9/3600))","v":1.1187862209729731},{"$f":"Herbstfrühjahr!I127/(3.7*(Temperaturen!$B$9/3600))","v":0.66488127678303399},null,{"$f":"Winter!D125/(3.7*(Temperaturen!$B$9/3600))","v":0},{"$f":"Winter!E125/(3.7*(Temperaturen!$B$9/3600))","v":0},{"$f":"Winter!F125/(3.7*(Temperaturen!$B$9/3600))","v":0},{"$f":"Winter!G125/(3.7*(Temperaturen!$B$9/3600))","v":0},{"$f":"Winter!H125/(3.7*(Temperaturen!$B$9/3600))","v":0.60348308360286829},{"$f":"Winter!I125/(3.7*(Temperaturen!$B$9/3600))","v":0.12680771601849225}]
[null,null,"Solar VL Temperatur (°C) > ",{"$f":"$B$2+$B$6+(D180/2)","v":60.466742367121618},60.32724504554642,60.405557229927489,60.305108354147251,60.922438994147825,60.559003869849995,null,{"$f":"Temperaturen!$B$2+Temperaturen!$B$6+(K180/2)","v":60.083946599674057},{"$f":"Temperaturen!$B$2+Temperaturen!$B$6+(L180/2)","v":60},{"$f":"Temperaturen!$B$2+Temperaturen!$B$6+(M180/2)","v":60.043409717296541},{"$f":"Temperaturen!$B$2+Temperaturen!$B$6+(N180/2)","v":60},{"$f":"Temperaturen!$B$2+Temperaturen!$B$6+(O180/2)","v":60.559393110486489},{"$f":"Temperaturen!$B$2+Temperaturen!$B$6+(P180/2)","v":60.332440638391517},null,{"$f":"Temperaturen!$B$2+Temperaturen!$B$6+(R180/2)","v":60},{"$f":"Temperaturen!$B$2+Temperaturen!$B$6+(S180/2)","v":60},{"$f":"Temperaturen!$B$2+Temperaturen!$B$6+(T180/2)","v":60},{"$f":"Temperaturen!$B$2+Temperaturen!$B$6+(U180/2)","v":60},{"$f":"Temperaturen!$B$2+Temperaturen!$B$6+(V180/2)","v":60.301741541801434},{"$f":"Temperaturen!$B$2+Temperaturen!$B$6+(W180/2)","v":60.063403858009245}]
[null,null,"Solar RL Temperatur (°C) > ",{"$f":"$B$2+$B$6-(D180/2)","v":59.533257632878382},59.67275495445358,59.594442770072511,59.694891645852749,59.077561005852175,59.440996130150005,null,{"$f":"Temperaturen!$B$2+Temperaturen!$B$6-(K180/2)","v":59.916053400325943},{"$f":"Temperaturen!$B$2+Temperaturen!$B$6-(L180/2)","v":60},{"$f":"Temperaturen!$B$2+Temperaturen!$B$6-(M180/2)","v":59.956590282703459},{"$f":"Temperaturen!$B$2+Temperaturen!$B$6-(N180/2)","v":60},{"$f":"Temperaturen!$B$2+Temperaturen!$B$6-(O180/2)","v":59.440606889513511},{"$f":"Temperaturen!$B$2+Temperaturen!$B$6-(P180/2)","v":59.667559361608483},null,{"$f":"Temperaturen!$B$2+Temperaturen!$B$6-(R180/2)","v":60},{"$f":"Temperaturen!$B$2+Temperaturen!$B$6-(S180/2)","v":60},{"$f":"Temperaturen!$B$2+Temperaturen!$B$6-(T180/2)","v":60},{"$f":"Temperaturen!$B$2+Temperaturen!$B$6-(U180/2)","v":60},{"$f":"Temperaturen!$B$2+Temperaturen!$B$6-(V180/2)","v":59.698258458198566},{"$f":"Temperaturen!$B$2+Temperaturen!$B$6-(W180/2)","v":59.936596141990755}]
["stark wolkig Azimut > ",40,"Diff. Solarkreis (K) > ",{"$f":"Sommer!D126/(3.7*($B$9/3600))","v":0.79555729427027},{"$f":"Sommer!E126/(3.7*($B$9/3600))","v":0.54298742524089294},{"$f":"Sommer!F126/(3.7*($B$9/3600))","v":0.69301202223373148},{"$f":"Sommer!G126/(3.7*($B$9/3600))","v":0.49959667261350021},{"$f":"Sommer!H126/(3.7*($B$9/3600))","v":1.7591124500717044},{"$f":"Sommer!I126/(3.7*($B$9/3600))","v":1.1781009672313461},null,{"$f":"Herbstfrühjahr!D130/(3.7*(Temperaturen!$B$9/3600))","v":0.5265673751974056},{"$f":"Herbstfrühjahr!E130/(3.7*(Temperaturen!$B$9/3600))","v":0.35255947731077181},{"$f":"Herbstfrühjahr!F130/(3.7*(Temperaturen!$B$9/3600))","v":0.45959920954500427},{"$f":"Herbstfrühjahr!G130/(3.7*(Temperaturen!$B$9/3600))","v":0.3209533046405541},{"$f":"Herbstfrühjahr!H130/(3.7*(Temperaturen!$B$9/3600))","v":1.3099483964893548},{"$f":"Herbstfrühjahr!I130/(3.7*(Temperaturen!$B$9/3600))","v":0.70339425334796868},null,{"$f":"Winter!D126/(3.7*(Temperaturen!$B$9/3600))","v":0},{"$f":"Winter!E126/(3.7*(Temperaturen!$B$9/3600))","v":0},{"$f":"Winter!F126/(3.7*(Temperaturen!$B$9/3600))","v":0},{"$f":"Winter!G126/(3.7*(Temperaturen!$B$9/3600))","v":0},{"$f":"Winter!H126/(3.7*(Temperaturen!$B$9/3600))","v":0.21006430754991737},{"$f":"Winter!I126/(3.7*(Temperaturen!$B$9/3600))","v":0}]
[null,null,"Solar VL Temperatur (°C) > ",{"$f":"$B$2+$B$6+(D183/2)","v":60.397778647135134},60.271493712620448,60.346506011116865,60.249798336306753,60.879556225035856,60.589050483615672,null,{"$f":"Temperaturen!$B$2+Temperaturen!$B$6+(K183/2)","v":60.263283687598701},{"$f":"Temperaturen!$B$2+Temperaturen!$B$6+(L183/2)","v":60.176279738655388},{"$f":"Temperaturen!$B$2+Temperaturen!$B$6+(M183/2)","v":60.229799604772502},{"$f":"Temperaturen!$B$2+Temperaturen!$B$6+(N183/2)","v":60.160476652320277},{"$f":"Temperaturen!$B$2+Temperaturen!$B$6+(O183/2)","v":60.65497419824468},{"$f":"Temperaturen!$B$2+Temperaturen!$B$6+(P183/2)","v":60.351697126673983},null,{"$f":"Temperaturen!$B$2+Temperaturen!$B$6+(R183/2)","v":60},{"$f":"Temperaturen!$B$2+Temperaturen!$B$6+(S183/2)","v":60},{"$f":"Temperaturen!$B$2+Temperaturen!$B$6+(T183/2)","v":60},{"$f":"Temperaturen!$B$2+Temperaturen!$B$6+(U183/2)","v":60},{"$f":"Temperaturen!$B$2+Temperaturen!$B$6+(V183/2)","v":60.105032153774957},{"$f":"Temperaturen!$B$2+Temperaturen!$B$6+(W183/2)","v":60}]
[null,null,"Solar RL Temperatur (°C) > ",{"$f":"$B$2+$B$6-(D183/2)","v":59.602221352864866},59.728506287379552,59.653493988883135,59.750201663693247,59.120443774964144,59.410949516384328,null,{"$f":"Temperaturen!$B$2+Temperaturen!$B$6-(K183/2)","v":59.736716312401299},{"$f":"Temperaturen!$B$2+Temperaturen!$B$6-(L183/2)","v":59.823720261344612},{"$f":"Temperaturen!$B$2+Temperaturen!$B$6-(M183/2)","v":59.770200395227498},{"$f":"Temperaturen!$B$2+Temperaturen!$B$6-(N183/2)","v":59.839523347679723},{"$f":"Temperaturen!$B$2+Temperaturen!$B$6-(O183/2)","v":59.34502580175532},{"$f":"Temperaturen!$B$2+Temperaturen!$B$6-(P183/2)","v":59.648302873326017},null,{"$f":"Temperaturen!$B$2+Temperaturen!$B$6-(R183/2)","v":60},{"$f":"Temperaturen!$B$2+Temperaturen!$B$6-(S183/2)","v":60},{"$f":"Temperaturen!$B$2+Temperaturen!$B$6-(T183/2)","v":60},{"$f":"Temperaturen!$B$2+Temperaturen!$B$6-(U183/2)","v":60},{"$f":"Temperaturen!$B$2+Temperaturen!$B$6-(V183/2)","v":59.894967846225043},{"$f":"Temperaturen!$B$2+Temperaturen!$B$6-(W183/2)","v":60}]
["stark wolkig Azimut > ",50,"Diff. Solarkreis (K) > ",{"$f":"Sommer!D127/(3.7*($B$9/3600))","v":0.61028112356756803},{"$f":"Sommer!E127/(3.7*($B$9/3600))","v":0.36656481240893068},{"$f":"Sommer!F127/(3.7*($B$9/3600))","v":0.50433295338544115},{"$f":"Sommer!G127/(3.7*($B$9/3600))","v":0.32863144721075777},{"$f":"Sommer!H127/(3.7*($B$9/3600))","v":1.5606385021621625},{"$f":"Sommer!I127/(3.7*($B$9/3600))","v":1.0915321459924998},null,{"$f":"Herbstfrühjahr!D133/(3.7*(Temperaturen!$B$9/3600))","v":0},{"$f":"Herbstfrühjahr!E133/(3.7*(Temperaturen!$B$9/3600))","v":0},{"$f":"Herbstfrühjahr!F133/(3.7*(Temperaturen!$B$9/3600))","v":0},{"$f":"Herbstfrühjahr!G133/(3.7*(Temperaturen!$B$9/3600))","v":0},{"$f":"Herbstfrühjahr!H133/(3.7*(Temperaturen!$B$9/3600))","v":0},{"$f":"Herbstfrühjahr!I133/(3.7*(Temperaturen!$B$9/3600))","v":0},null,{"$f":"Winter!D127/(3.7*(Temperaturen!$B$9/3600))","v":0},{"$f":"Winter!E127/(3.7*(Temperaturen!$B$9/3600))","v":0},{"$f":"Winter!F127/(3.7*(Temperaturen!$B$9/3600))","v":0},{"$f":"Winter!G127/(3.7*(Temperaturen!$B$9/3600))","v":0},{"$f":"Winter!H127/(3.7*(Temperaturen!$B$9/3600))","v":0},{"$f":"Winter!I127/(3.7*(Temperaturen!$B$9/3600))","v":0}]
[null,null,"Solar VL Temperatur (°C) > ",{"$f":"$B$2+$B$6+(D186/2)","v":60.305140561783787},60.183282406204462,60.252166476692722,60.164315723605377,60.780319251081082,60.545766072996251,null,{"$f":"Temperaturen!$B$2+Temperaturen!$B$6+(K186/2)","v":60},{"$f":"Temperaturen!$B$2+Temperaturen!$B$6+(L186/2)","v":60},{"$f":"Temperaturen!$B$2+Temperaturen!$B$6+(M186/2)","v":60},{"$f":"Temperaturen!$B$2+Temperaturen!$B$6+(N186/2)","v":60},{"$f":"Temperaturen!$B$2+Temperaturen!$B$6+(O186/2)","v":60},{"$f":"Temperaturen!$B$2+Temperaturen!$B$6+(P186/2)","v":60},null,{"$f":"Temperaturen!$B$2+Temperaturen!$B$6+(R186/2)","v":60},{"$f":"Temperaturen!$B$2+Temperaturen!$B$6+(S186/2)","v":60},{"$f":"Temperaturen!$B$2+Temperaturen!$B$6+(T186/2)","v":60},{"$f":"Temperaturen!$B$2+Temperaturen!$B$6+(U186/2)","v":60},{"$f":"Temperaturen!$B$2+Temperaturen!$B$6+(V186/2)","v":60},{"$f":"Temperaturen!$B$2+Temperaturen!$B$6+(W186/2)","v":60}]
[null,null,"Solar RL Temperatur (°C) > ",{"$f":"$B$2+$B$6-(D186/2)","v":59.694859438216213},59.816717593795538,59.747833523307278,59.835684276394623,59.219680748918918,59.454233927003749,null,{"$f":"Temperaturen!$B$2+Temperaturen!$B$6-(K186/2)","v":60},{"$f":"Temperaturen!$B$2+Temperaturen!$B$6-(L186/2)","v":60},{"$f":"Temperaturen!$B$2+Temperaturen!$B$6-(M186/2)","v":60},{"$f":"Temperaturen!$B$2+Temperaturen!$B$6-(N186/2)","v":60},{"$f":"Temperaturen!$B$2+Temperaturen!$B$6-(O186/2)","v":60},{"$f":"Temperaturen!$B$2+Temperaturen!$B$6-(P186/2)","v":60},null,{"$f":"Temperaturen!$B$2+Temperaturen!$B$6-(R186/2)","v":60},{"$f":"Temperaturen!$B$2+Temperaturen!$B$6-(S186/2)","v":60},{"$f":"Temperaturen!$B$2+Temperaturen!$B$6-(T186/2)","v":60},{"$f":"Temperaturen!$B$2+Temperaturen!$B$6-(U186/2)","v":60},{"$f":"Temperaturen!$B$2+Temperaturen!$B$6-(V186/2)","v":60},{"$f":"Temperaturen!$B$2+Temperaturen!$B$6-(W186/2)","v":60}]
["stark wolkig Azimut > ",60,"Diff. Solarkreis (K) > ",{"$f":"Sommer!D128/(3.7*($B$9/3600))","v":0.33664756597297313},{"$f":"Sommer!E128/(3.7*($B$9/3600))","v":0.13143758213866052},{"$f":"Sommer!F128/(3.7*($B$9/3600))","v":0.25286869247575067},{"$f":"Sommer!G128/(3.7*($B$9/3600))","v":9.2708660897350484E-2},{"$f":"Sommer!H128/(3.7*($B$9/3600))","v":1.4728339303088807},{"$f":"Sommer!I128/(3.7*($B$9/3600))","v":0.87601234844536402},null,{"$f":"Herbstfrühjahr!D136/(3.7*(Temperaturen!$B$9/3600))","v":0},{"$f":"Herbstfrühjahr!E136/(3.7*(Temperaturen!$B$9/3600))","v":0},{"$f":"Herbstfrühjahr!F136/(3.7*(Temperaturen!$B$9/3600))","v":0},{"$f":"Herbstfrühjahr!G136/(3.7*(Temperaturen!$B$9/3600))","v":0},{"$f":"Herbstfrühjahr!H136/(3.7*(Temperaturen!$B$9/3600))","v":0},{"$f":"Herbstfrühjahr!I136/(3.7*(Temperaturen!$B$9/3600))","v":0},null,{"$f":"Winter!D128/(3.7*(Temperaturen!$B$9/3600))","v":0},{"$f":"Winter!E128/(3.7*(Temperaturen!$B$9/3600))","v":0},{"$f":"Winter!F128/(3.7*(Temperaturen!$B$9/3600))","v":0},{"$f":"Winter!G128/(3.7*(Temperaturen!$B$9/3600))","v":0},{"$f":"Winter!H128/(3.7*(Temperaturen!$B$9/3600))","v":0},{"$f":"Winter!I128/(3.7*(Temperaturen!$B$9/3600))","v":0}]
[null,null,"Solar VL Temperatur (°C) > ",{"$f":"$B$2+$B$6+(D189/2)","v":60.168323782986484},60.06571879106933,60.126434346237872,60.046354330448672,60.73641696515444,60.438006174222679,null,{"$f":"Temperaturen!$B$2+Temperaturen!$B$6+(K189/2)","v":60},{"$f":"Temperaturen!$B$2+Temperaturen!$B$6+(L189/2)","v":60},{"$f":"Temperaturen!$B$2+Temperaturen!$B$6+(M189/2)","v":60},{"$f":"Temperaturen!$B$2+Temperaturen!$B$6+(N189/2)","v":60},{"$f":"Temperaturen!$B$2+Temperaturen!$B$6+(O189/2)","v":60},{"$f":"Temperaturen!$B$2+Temperaturen!$B$6+(P189/2)","v":60},null,{"$f":"Temperaturen!$B$2+Temperaturen!$B$6+(R189/2)","v":60},{"$f":"Temperaturen!$B$2+Temperaturen!$B$6+(S189/2)","v":60},{"$f":"Temperaturen!$B$2+Temperaturen!$B$6+(T189/2)","v":60},{"$f":"Temperaturen!$B$2+Temperaturen!$B$6+(U189/2)","v":60},{"$f":"Temperaturen!$B$2+Temperaturen!$B$6+(V189/2)","v":60},{"$f":"Temperaturen!$B$2+Temperaturen!$B$6+(W189/2)","v":60}]
[null,null,"Solar RL Temperatur (°C) > ",{"$f":"$B$2+$B$6-(D189/2)","v":59.831676217013516},59.93428120893067,59.873565653762128,59.953645669551328,59.26358303484556,59.561993825777321,null,{"$f":"Temperaturen!$B$2+Temperaturen!$B$6-(K189/2)","v":60},{"$f":"Temperaturen!$B$2+Temperaturen!$B$6-(L189/2)","v":60},{"$f":"Temperaturen!$B$2+Temperaturen!$B$6-(M189/2)","v":60},{"$f":"Temperaturen!$B$2+Temperaturen!$B$6-(N189/2)","v":60},{"$f":"Temperaturen!$B$2+Temperaturen!$B$6-(O189/2)","v":60},{"$f":"Temperaturen!$B$2+Temperaturen!$B$6-(P189/2)","v":60},null,{"$f":"Temperaturen!$B$2+Temperaturen!$B$6-(R189/2)","v":60},{"$f":"Temperaturen!$B$2+Temperaturen!$B$6-(S189/2)","v":60},{"$f":"Temperaturen!$B$2+Temperaturen!$B$6-(T189/2)","v":60},{"$f":"Temperaturen!$B$2+Temperaturen!$B$6-(U189/2)","v":60},{"$f":"Temperaturen!$B$2+Temperaturen!$B$6-(V189/2)","v":60},{"$f":"Temperaturen!$B$2+Temperaturen!$B$6-(W189/2)","v":60}]
["stark wolkig Azimut > ",70,"Diff. Solarkreis (K) > ",{"$f":"Sommer!D129/(3.7*($B$9/3600))","v":0},{"$f":"Sommer!E129/(3.7*($B$9/3600))","v":0},{"$f":"Sommer!F129/(3.7*($B$9/3600))","v":0},{"$f":"Sommer!G129/(3.7*($B$9/3600))","v":0},{"$f":"Sommer!H129/(3.7*($B$9/3600))","v":0.34473782412575843},{"$f":"Sommer!I129/(3.7*($B$9/3600))","v":0},null,{"$f":"Herbstfrühjahr!D139/(3.7*(Temperaturen!$B$9/3600))","v":0},{"$f":"Herbstfrühjahr!E139/(3.7*(Temperaturen!$B$9/3600))","v":0},{"$f":"Herbstfrühjahr!F139/(3.7*(Temperaturen!$B$9/3600))","v":0},{"$f":"Herbstfrühjahr!G139/(3.7*(Temperaturen!$B$9/3600))","v":0},{"$f":"Herbstfrühjahr!H139/(3.7*(Temperaturen!$B$9/3600))","v":0},{"$f":"Herbstfrühjahr!I139/(3.7*(Temperaturen!$B$9/3600))","v":0},null,{"$f":"Winter!D129/(3.7*(Temperaturen!$B$9/3600))","v":0},{"$f":"Winter!E129/(3.7*(Temperaturen!$B$9/3600))","v":0},{"$f":"Winter!F129/(3.7*(Temperaturen!$B$9/3600))","v":0},{"$f":"Winter!G129/(3.7*(Temperaturen!$B$9/3600))","v":0},{"$f":"Winter!H129/(3.7*(Temperaturen!$B$9/3600))","v":0},{"$f":"Winter!I129/(3.7*(Temperaturen!$B$9/3600))","v":0}]
[null,null,"Solar VL Temperatur (°C) > ",{"$f":"$B$2+$B$6+(D192/2)","v":60},60,60,60,60.172368912062879,60,null,{"$f":"Temperaturen!$B$2+Temperaturen!$B$6+(K192/2)","v":60},{"$f":"Temperaturen!$B$2+Temperaturen!$B$6+(L192/2)","v":60},{"$f":"Temperaturen!$B$2+Temperaturen!$B$6+(M192/2)","v":60},{"$f":"Temperaturen!$B$2+Temperaturen!$B$6+(N192/2)","v":60},{"$f":"Temperaturen!$B$2+Temperaturen!$B$6+(O192/2)","v":60},{"$f":"Temperaturen!$B$2+Temperaturen!$B$6+(P192/2)","v":60},null,{"$f":"Temperaturen!$B$2+Temperaturen!$B$6+(R192/2)","v":60},{"$f":"Temperaturen!$B$2+Temperaturen!$B$6+(S192/2)","v":60},{"$f":"Temperaturen!$B$2+Temperaturen!$B$6+(T192/2)","v":60},{"$f":"Temperaturen!$B$2+Temperaturen!$B$6+(U192/2)","v":60},{"$f":"Temperaturen!$B$2+Temperaturen!$B$6+(V192/2)","v":60},{"$f":"Temperaturen!$B$2+Temperaturen!$B$6+(W192/2)","v":60}]
[null,null,"Solar RL Temperatur (°C) > ",{"$f":"$B$2+$B$6-(D192/2)","v":60},60,60,60,59.827631087937121,60,null,{"$f":"Temperaturen!$B$2+Temperaturen!$B$6-(K192/2)","v":60},{"$f":"Temperaturen!$B$2+Temperaturen!$B$6-(L192/2)","v":60},{"$f":"Temperaturen!$B$2+Temperaturen!$B$6-(M192/2)","v":60},{"$f":"Temperaturen!$B$2+Temperaturen!$B$6-(N192/2)","v":60},{"$f":"Temperaturen!$B$2+Temperaturen!$B$6-(O192/2)","v":60},{"$f":"Temperaturen!$B$2+Temperaturen!$B$6-(P192/2)","v":60},null,{"$f":"Temperaturen!$B$2+Temperaturen!$B$6-(R192/2)","v":60},{"$f":"Temperaturen!$B$2+Temperaturen!$B$6-(S192/2)","v":60},{"$f":"Temperaturen!$B$2+Temperaturen!$B$6-(T192/2)","v":60},{"$f":"Temperaturen!$B$2+Temperaturen!$B$6-(U192/2)","v":60},{"$f":"Temperaturen!$B$2+Temperaturen!$B$6-(V192/2)","v":60},{"$f":"Temperaturen!$B$2+Temperaturen!$B$6-(W192/2)","v":60}]
[]
[]
["Schnittwerte",null,{"$f":"Eingaben!C96","v":"Kollektor > "},{"$f":"Eingaben!D96","v":"SolRose 26"},{"$f":"Eingaben!E96","v":"Synergie 210"},{"$f":"Eingaben!F96","v":"Sunex AMX 2,85"},{"$f":"Eingaben!G96","v":"Sunex 2,0"},{"$f":"Eingaben!H96","v":"Star Azzurro CPC"},{"$f":"Eingaben!I96","v":"Billig VRK"}]
[]
[null,null,"Schnitt der VL/RL Temp. und Diff. im Solarkreis über den ganzen Tag bei den eingestellten Vorgaben (Fläche , Diff. AT zur mittleren Kol.Temp. usw.)"]
[]
[null,null,"bei den grau hinterlegten Werten , wird die Anlage kaum laufen (Diff.Schnitt im Solarkreis < 3K) "]
[]
["Sommer bei Sonne",null,"Diff. Solarkreis (K) > ",{"$f":"Eingaben!D43/(3.7*($B$9/3600))","v":8.8934859801405413},{"$f":"Eingaben!E43/(3.7*($B$9/3600))","v":8.2886635197117151},{"$f":"Eingaben!F43/(3.7*($B$9/3600))","v":8.8135328058001683},{"$f":"Eingaben!G43/(3.7*($B$9/3600))","v":8.2335909580295592},{"$f":"Eingaben!H43/(3.7*($B$9/3600))","v":8.2581991114550473},{"$f":"Eingaben!I43/(3.7*($B$9/3600))","v":6.8412091312763463}]
[null,null,"Solar VL Temperatur (°C) > ",{"$f":"$B$2+$B$6+(D203/2)","v":64.446742990070277},64.144331759855859,64.406766402900089,64.116795479014783,64.129099555727521,63.420604565638172]
[null,null,"Solar RL Temperatur (°C) > ",{"$f":"$B$2+$B$6-(D203/2)","v":55.55325700992973},55.855668240144141,55.593233597099918,55.883204520985217,55.870900444272479,56.579395434361828]
["Sommer leicht bewölkt",null,"Diff. Solarkreis (K) > ",{"$f":"Eingaben!D47/(3.7*($B$9/3600))","v":6.164450070681081},{"$f":"Eingaben!E47/(3.7*($B$9/3600))","v":5.6782250859694487},{"$f":"Eingaben!F47/(3.7*($B$9/3600))","v":6.0756375469275827},{"$f":"Eingaben!G47/(3.7*($B$9/3600))","v":5.6275766369751032},{"$f":"Eingaben!H47/(3.7*($B$9/3600))","v":6.0685304463210157},{"$f":"Eingaben!I47/(3.7*($B$9/3600))","v":4.8882355626535627}]
[null,null,"Solar VL Temperatur (°C) > ",{"$f":"$B$2+$B$6+(D206/2)","v":63.082225035340542},62.839112542984722,63.03781877346379,62.813788318487553,63.03426522316051,62.444117781326781]
[null,null,"Solar RL Temperatur (°C) > ",{"$f":"$B$2+$B$6-(D206/2)","v":56.917774964659458},57.160887457015278,56.96218122653621,57.186211681512447,56.96573477683949,57.555882218673219]
["Sommer mittel bewölkt",null,"Diff. Solarkreis (K) > ",{"$f":"Eingaben!D51/(3.7*($B$9/3600))","v":3.4354141612216225},{"$f":"Eingaben!E51/(3.7*($B$9/3600))","v":3.0677866522271846},{"$f":"Eingaben!F51/(3.7*($B$9/3600))","v":3.3377422880549954},{"$f":"Eingaben!G51/(3.7*($B$9/3600))","v":3.0215623159206508},{"$f":"Eingaben!H51/(3.7*($B$9/3600))","v":3.8788617811869823},{"$f":"Eingaben!I51/(3.7*($B$9/3600))","v":2.9352619940307778}]
[null,null,"Solar VL Temperatur (°C) > ",{"$f":"$B$2+$B$6+(D209/2)","v":61.717707080610808},61.533893326113592,61.668871144027499,61.510781157960324,61.939430890593492,61.467630997015391]
[null,null,"Solar RL Temperatur (°C) > ",{"$f":"$B$2+$B$6-(D209/2)","v":58.282292919389192},58.466106673886408,58.331128855972501,58.489218842039676,58.060569109406508,58.532369002984609]
["Sommer stark bewölkt",null,"Diff. Solarkreis (K) > ",{"$f":"Eingaben!D55/(3.7*($B$9/3600))","v":0.70416675898378389},{"$f":"Eingaben!E55/(3.7*($B$9/3600))","v":0.47898636529259703},{"$f":"Eingaben!F55/(3.7*($B$9/3600))","v":0.6089818308111874},{"$f":"Eingaben!G55/(3.7*($B$9/3600))","v":0.44194920755159106},{"$f":"Eingaben!H55/(3.7*($B$9/3600))","v":1.5632114683088807},{"$f":"Eingaben!I55/(3.7*($B$9/3600))","v":0.91704720130081474}]
[null,null,"Solar VL Temperatur (°C) > ",{"$f":"$B$2+$B$6+(D212/2)","v":60.352083379491894},60.239493182646299,60.304490915405594,60.220974603775794,60.781605734154439,60.458523600650409]
[null,null,"Solar RL Temperatur (°C) > ",{"$f":"$B$2+$B$6-(D212/2)","v":59.647916620508106},59.760506817353701,59.695509084594406,59.779025396224206,59.218394265845561,59.541476399349591]
["Frühjahr Herbst bei Sonne",null,"Diff. Solarkreis (K) > ",{"$f":"Eingaben!D59/(3.7*($B$9/3600))","v":7.1276628562196773},{"$f":"Eingaben!E59/(3.7*($B$9/3600))","v":6.5795982299901308},{"$f":"Eingaben!F59/(3.7*($B$9/3600))","v":7.0218862437475469},{"$f":"Eingaben!G59/(3.7*($B$9/3600))","v":6.5149935738154738},{"$f":"Eingaben!H59/(3.7*($B$9/3600))","v":6.590241895017761},{"$f":"Eingaben!I59/(3.7*($B$9/3600))","v":5.3727500429109547}]
[null,null,"Solar VL Temperatur (°C) > ",{"$f":"$B$3+$B$7+(D215/2)","v":50.563831428109836},50.289799114995063,50.510943121873773,50.257496786907737,50.295120947508877,49.686375021455476]
[null,null,"Solar RL Temperatur (°C) > ",{"$f":"$B$3+$B$7-(D215/2)","v":43.436168571890164},43.710200885004937,43.489056878126227,43.742503213092263,43.704879052491123,44.313624978544524]
["Frühjahr Herbst leicht bewölkt",null,"Diff. Solarkreis (K) > ",{"$f":"Eingaben!D63/(3.7*($B$9/3600))","v":4.8885003133439993},{"$f":"Eingaben!E63/(3.7*($B$9/3600))","v":4.4468411337551119},{"$f":"Eingaben!F63/(3.7*($B$9/3600))","v":4.7859523951297849},{"$f":"Eingaben!G63/(3.7*($B$9/3600))","v":4.3869644039259752},{"$f":"Eingaben!H63/(3.7*($B$9/3600))","v":4.8301440621749592},{"$f":"Eingaben!I63/(3.7*($B$9/3600))","v":3.8098335455817924}]
[null,null,"Solar VL Temperatur (°C) > ",{"$f":"$B$3+$B$7+(D218/2)","v":49.444250156671998},49.223420566877557,49.392976197564892,49.193482201962986,49.415072031087476,48.904916772790898]
[null,null,"Solar RL Temperatur (°C) > ",{"$f":"$B$3+$B$7-(D218/2)","v":44.555749843328002},44.776579433122443,44.607023802435108,44.806517798037014,44.584927968912524,45.095083227209102]
["Frühjahr Herbst mittel bewölkt",null,"Diff. Solarkreis (K) > ",{"$f":"Eingaben!D67/(3.7*($B$9/3600))","v":2.6493377704683252},{"$f":"Eingaben!E67/(3.7*($B$9/3600))","v":2.3185345942110462},{"$f":"Eingaben!F67/(3.7*($B$9/3600))","v":2.5500185465120255},{"$f":"Eingaben!G67/(3.7*($B$9/3600))","v":2.2689245230626023},{"$f":"Eingaben!H67/(3.7*($B$9/3600))","v":3.0700462293321573},{"$f":"Eingaben!I67/(3.7*($B$9/3600))","v":2.2469170482526315}]
[null,null,"Solar VL Temperatur (°C) > ",{"$f":"$B$3+$B$7+(D221/2)","v":48.324668885234161},48.159267297105522,48.275009273256011,48.134462261531304,48.535023114666082,48.123458524126313]
[null,null,"Solar RL Temperatur (°C) > ",{"$f":"$B$3+$B$7-(D221/2)","v":45.675331114765839},45.840732702894478,45.724990726743989,45.865537738468696,45.464976885333918,45.876541475873687]
["Frühjahr Herbst stark bewolkt",null,"Diff. Solarkreis (K) > ",{"$f":"Eingaben!D71/(3.7*($B$9/3600))","v":0.5265673751974056},{"$f":"Eingaben!E71/(3.7*($B$9/3600))","v":0.35255947731077181},{"$f":"Eingaben!F71/(3.7*($B$9/3600))","v":0.45959920954500427},{"$f":"Eingaben!G71/(3.7*($B$9/3600))","v":0.3209533046405541},{"$f":"Eingaben!H71/(3.7*($B$9/3600))","v":1.3099483964893548},{"$f":"Eingaben!I71/(3.7*($B$9/3600))","v":0.70339425334796868}]
[null,null,"Solar VL Temperatur (°C) > ",{"$f":"$B$3+$B$7+(D224/2)","v":47.263283687598701},47.176279738655388,47.229799604772502,47.160476652320277,47.65497419824468,47.351697126673983]
[null,null,"Solar RL Temperatur (°C) > ",{"$f":"$B$3+$B$7-(D224/2)","v":46.736716312401299},46.823720261344612,46.770200395227498,46.839523347679723,46.34502580175532,46.648302873326017]
["Winter bei Sonne",null,"Diff. Solarkreis (K) > ",{"$f":"Eingaben!D75/(3.7*($B$9/3600))","v":2.5107378845740547},{"$f":"Eingaben!E75/(3.7*($B$9/3600))","v":2.2575858712466905},{"$f":"Eingaben!F75/(3.7*($B$9/3600))","v":2.4450649021764006},{"$f":"Eingaben!G75/(3.7*($B$9/3600))","v":2.2135301500779132},{"$f":"Eingaben!H75/(3.7*($B$9/3600))","v":2.4749466269908442},{"$f":"Eingaben!I75/(3.7*($B$9/3600))","v":1.774551309324754}]
[null,null,"Solar VL Temperatur (°C) > ",{"$f":"$B$4+$B$8+(D227/2)","v":34.255368942287028},34.128792935623345,34.222532451088199,34.106765075038957,34.237473313495421,33.887275654662375]
[null,null,"Solar RL Temperatur (°C) > ",{"$f":"$B$4+$B$8-(D227/2)","v":31.744631057712972},31.871207064376655,31.777467548911801,31.893234924961043,31.762526686504579,32.112724345337625]
["Winter leicht bewölkt",null,"Diff. Solarkreis (K) > ",{"$f":"Eingaben!D79/(3.7*($B$9/3600))","v":1.6317557717570275},{"$f":"Eingaben!E79/(3.7*($B$9/3600))","v":1.428617401487192},{"$f":"Eingaben!F79/(3.7*($B$9/3600))","v":1.5765431711493738},{"$f":"Eingaben!G79/(3.7*($B$9/3600))","v":1.3879690057722276},{"$f":"Eingaben!H79/(3.7*($B$9/3600))","v":1.7871902934971875},{"$f":"Eingaben!I79/(3.7*($B$9/3600))","v":1.217806704735539}]
[null,null,"Solar VL Temperatur (°C) > ",{"$f":"$B$4+$B$8+(D230/2)","v":33.815877885878514},33.714308700743594,33.788271585574684,33.693984502886117,33.893595146748595,33.608903352367768]
[null,null,"Solar RL Temperatur (°C) > ",{"$f":"$B$4+$B$8-(D230/2)","v":32.184122114121486},32.285691299256406,32.211728414425316,32.306015497113883,32.106404853251405,32.391096647632232]
["Winter mittel bewölkt",null,"Diff. Solarkreis (K) > ",{"$f":"Eingaben!D83/(3.7*($B$9/3600))","v":0.76805318547145962},{"$f":"Eingaben!E83/(3.7*($B$9/3600))","v":0.63813470431210373},{"$f":"Eingaben!F83/(3.7*($B$9/3600))","v":0.73091826140691207},{"$f":"Eingaben!G83/(3.7*($B$9/3600))","v":0.6083329749020906},{"$f":"Eingaben!H83/(3.7*($B$9/3600))","v":1.0994339600035303},{"$f":"Eingaben!I83/(3.7*($B$9/3600))","v":0.66839806969612836}]
[null,null,"Solar VL Temperatur (°C) > ",{"$f":"$B$4+$B$8+(D233/2)","v":33.384026592735729},33.319067352156054,33.365459130703456,33.304166487451049,33.549716980001762,33.334199034848062]
[null,null,"Solar RL Temperatur (°C) > ",{"$f":"$B$4+$B$8-(D233/2)","v":32.615973407264271},32.680932647843946,32.634540869296544,32.695833512548951,32.450283019998238,32.665800965151938]
["Winter stark bewölkt",null,"Diff. Solarkreis (K) > ",{"$f":"Eingaben!D87/(3.7*($B$9/3600))","v":4.6391072497297368E-2},{"$f":"Eingaben!E87/(3.7*($B$9/3600))","v":6.9723500195848446E-3},{"$f":"Eingaben!F87/(3.7*($B$9/3600))","v":3.4251298073264901E-2},{"$f":"Eingaben!G87/(3.7*($B$9/3600))","v":4.7558671814670905E-4},{"$f":"Eingaben!H87/(3.7*($B$9/3600))","v":0.43188578110446785},{"$f":"Eingaben!I87/(3.7*($B$9/3600))","v":0.15231285488131391}]
[null,null,"Solar VL Temperatur (°C) > ",{"$f":"$B$4+$B$8+(D236/2)","v":33.02319553624865},33.00348617500979,33.017125649036629,33.000237793359076,33.215942890552235,33.076156427440658]
[null,null,"Solar RL Temperatur (°C) > ",{"$f":"$B$4+$B$8-(D236/2)","v":32.97680446375135},32.99651382499021,32.982874350963371,32.999762206640924,32.784057109447765,32.923843572559342]

{"sheet":"Info","index":9,"n_rows":29,"n_cols":1,"rows_kept":29,"cut":false,"hidden":false,"merged":[]}
["Info zum Tool (Eingabehilfe siehe Bild unten )"]
["das Tool berechnet die Solarleistung bei Sonne, mit einer wählbaren Bruttofläche bei einer bestimmten  Diff. (wählbar) mit Berücksichtigung des eingetragenen IAM (Winkelfaktor von Azimut -70 bis +70°)"]
["der Jahreszeit entsprechend mit der passenden Einstrahlung ! (Daten aus Getsolar)"]
["die Ermittlung der Strahlungsdaten erfolgte mit Getsolar (Standort 48,8 Breitengrad bei Neigungswinkel 50° )"]
["die Werte sind für diesen Standort bei Sommer Frühjahr/Herbst (~gleiche Strahlung) und Winter eingetragen "]
["zur Hochrechnung der Tagesleistung auf das ganze Jahr , wurden aus 3 Jahren Praxisdaten in Würzburg , der Schnitt für Sommer,Frühjahr,Herbst,Winter für sonnige ,leichtbewölkte,mittel bewölkte und stark bewölkte Tage eingetragen"]
["die Daten der Kollektoren sind aus den Prüfberichten entnommen (leider haben nicht alle Prüfberichte die IAM Werte in 10° Stufen eingetragen !)"]
["Quellen (Prüfberichte, SPF Factsheetdaten)"]
["Prüfberichte (Keymark Datenbank)"]
["Daten sind tlw auch hier in der Factsheet pdf der jeweiligen Kollektoren ersichtlich (SPF Prüfanstalt)"]
[]
["es kann natürlich jeder x beliebige Kollektor oder Strahlungsdaten von anderen Standorten und anderen Datum (auch für andere Neigungen) eingetragen werden "]
[]
["es wird die reale Bruttoleistung der eingetragenen Kollektorfläche berechnet , zusätzlich wird der Ertrag und die Speichererwärmung hochgerechnet ! (wenn die Lfz. Und das Puffervolumen eingetragen sind)"]
["Diff 30 wird bei guten Solaranlagen in meinen Auswertungen im Schnitt erreicht !  (bei Anlagen mit höheren Temp. Mit ~ Diff. 40 rechnen lassen , bei Vorwärmung unter Diff. 30)"]
["im Diagramm wird eine Übersicht der KW Leistung in allen Jahreszeiten angezeigt  "]
["im Max.Peak Diagramm wird der Max.Peak der verschiedenen Modulflächen berechnet (Wert und Diagramm) und kann als Gegenprüfung mit Daten der Prüfberichte (din certco) verglichen werden "]
["alle Beispiele wurden mit den Prüfberichten gegengeprüft "]
["zusätzlich wird ein Diagramm bei gleicher variabel eintragbarer Bruttofläche angezeigt ! "]
[]
["viel spass beim testen "]
["Passwort = \"solartirol\" für eigene Änderungen "]
["Kontakt >   mailto:sys34@aon.at?subject=Iamverlauf Tool"]
["Fehler oder auch Anregungen bitte bei mir melden (Kontakt auf meiner HP) Danke mfG Manfred G.  "]
["Formeln >      η(x) = η0 – a1 * x – a2 * G * x²          η=η0 - a1·x - a2·G·x2            x=(tm-ta)/G "]
[]
["Hinweis > die Erträge werden nur zwischen Azimut -70 und +70 hochgerechnet (es ist natürlich mehr Ertrag möglich, wenn die Sonne länger vorhanden ist ) im Winter wird nur Azimut um -50 bis + 50 erreicht !"]
[]
["Eingabehilfe"]